program: Orca
programVersion: 5.0.2
elementType: Cl Cl Cl P O O O O C C C C C C C C C C H H H H H H H H H H
charge: 0
multiplicity: 1
keywords: wb97x-d3
keywords: def2-TZVPP
keywords: def2/J RIJCOSX
keywords: DEFGRID2
keywords: scfconv7
keywords: smallprint printgap noloewdin
keywords: NOSOSCF
formula: C10H10Cl3O4P
InChI: InChI=1/C10H10Cl3O4P/c1-15-18(14,16-2)17-10(6-11)8-4-3-7(12)5-9(8)13/h3-6H,1-2H3
28 atoms
Cl 1.093383 0.356303 2.539721
Cl 4.290353 -1.859656 -1.13973
Cl 0.298779 3.558925 -0.790423
P  -2.087668 -0.911914 0.435605
O  -1.604336 0.564574 0.886864
O  -3.555472 -0.947727 1.020839
O  -2.177359 -0.720077 -1.139367
O  -1.278851 -2.046682 0.908985
C  0.608699 0.517238 -0.113468
C  -0.623506 1.255658 0.213056
C  1.448319 0.027258 0.883336
C  0.938964 0.256008 -1.439941
C  2.585285 -0.701999 0.580996
C  2.068329 -0.471825 -1.770233
C  2.8785 -0.945799 -0.751105
C  -0.86835 2.530104 -0.061202
C  -4.533327 0.061155 0.736041
C  -1.998519 -1.829455 -2.030814
H  0.296014 0.621838 -2.229442
H  3.229082 -1.069318 1.368383
H  2.304919 -0.668102 -2.806723
H  -1.810432 3.004703 0.181173
H  -4.602721 0.267441 -0.332142
H  -4.307052 0.982808 1.271462
H  -5.488841 -0.324802 1.081265
H  -2.829922 -2.530022 -1.952699
H  -1.063171 -2.351613 -1.834414
H  -1.9732 -1.417673 -3.036118
elementType: Cl P O C H
totalener: -2410.15256454 hartree
nucrepener: 1988.38728367 hartree
electener: -4398.53984820 hartree
oneelecener: -7277.11005126 hartree
twoeener: 2878.57020306 hartree
cpcmener: -0.02830072 hartree
kineticenergy: 2404.49279018 hartree
xcener: -144.459047321429 hartree
chargesum: 0.0000000
charge: -0.058551 -0.074808 -0.074806 0.921817 -0.319222 -0.345288 -0.334669 -0.601251 0.049670 0.102757 0.023063 -0.189297 -0.118654 -0.122830 0.088043 -0.062276 -0.109453 -0.117300 0.161531 0.127611 0.147804 0.153617 0.119996 0.119158 0.127660 0.139698 0.118088 0.127892
qa: -0.0586 -0.0748 -0.0748 0.9218 -0.3192 -0.3453 -0.3347 -0.6013 0.0497 0.1028 0.0231 -0.1893 -0.1187 -0.1228 0.0880 -0.0623 -0.1095 -0.1173 0.1615 0.1276 0.1478 0.1536 0.1200 0.1192 0.1277 0.1397 0.1181 0.1279
va: 1.2656 1.2285 1.2423 5.6066 2.0852 2.1280 2.0469 2.0149 3.5405 3.8655 3.9575 3.9342 4.0451 3.9720 3.8944 4.0549 3.8385 3.8224 0.9999 1.0190 1.0025 0.9994 0.9919 0.9912 0.9906 0.9902 0.9959 0.9884
dispcorr: -0.016780142 hartree
energy: -2410.169344677433
dipole: -21.30279 19.58775 -1.71503 -5.24797 6.13307 0.88510 -9.07529 7.07167 -2.00362
magnitude: 2.78195 au
magnitude: 7.07115 debye
