program: Orca
programVersion: 5.0.2
elementType: Cl Cl Cl P O O O O C C C C C C C C C C H H H H H H H H H H
charge: 0
multiplicity: 1
keywords: wb97x-d3
keywords: def2-TZVPP
keywords: def2/J RIJCOSX
keywords: DEFGRID2
keywords: scfconv7
keywords: smallprint printgap noloewdin
keywords: NOSOSCF
formula: C10H10Cl3O4P
InChI: InChI=1/C10H10Cl3O4P/c1-15-18(14,16-2)17-10(6-11)8-4-3-7(12)5-9(8)13/h3-6H,1-2H3
28 atoms
Cl 1.335901 -0.664912 1.802241
Cl 4.416022 -1.273466 -2.519979
Cl 0.903446 2.725688 1.559473
P  -2.552533 -0.445314 0.359112
O  -1.65542 0.569727 -0.529274
O  -3.636161 -0.895405 -0.714578
O  -1.584642 -1.698988 0.448065
O  -3.070791 0.101719 1.619852
C  0.738012 0.470663 -0.586179
C  -0.479294 1.054775 0.004322
C  1.624785 -0.319185 0.139692
C  1.005912 0.680744 -1.935811
C  2.75821 -0.85815 -0.44881
C  2.129062 0.153653 -2.544587
C  3.002689 -0.611295 -1.787776
C  -0.516353 2.015514 0.918767
C  -4.843711 -0.15124 -0.852205
C  -1.671044 -2.614757 1.536132
H  0.320584 1.282337 -2.518207
H  3.437899 -1.464639 0.132063
H  2.325601 0.337702 -3.590928
H  -1.444991 2.400667 1.31641
H  -4.658531 0.818874 -1.315452
H  -5.332791 0.001126 0.109806
H  -5.497163 -0.729704 -1.500096
H  -0.780745 -3.235836 1.491341
H  -2.553498 -3.248641 1.442621
H  -1.699453 -2.096786 2.493797
totalener: -2410.13344972 hartree
nucrepener: 1971.63184917 hartree
electener: -4381.76529890 hartree
oneelecener: -7243.12070694 hartree
twoeener: 2861.35540804 hartree
kineticenergy: 2404.55547534 hartree
xcener: -144.465600571951 hartree
chargesum: 0.0000000
charge: -0.055088 -0.063279 -0.050092 0.909292 -0.334121 -0.327319 -0.325372 -0.522594 0.062490 0.083141 0.009849 -0.119821 -0.127731 -0.137340 0.081667 -0.012764 -0.124969 -0.148419 0.122150 0.114788 0.123476 0.125808 0.110198 0.119742 0.116144 0.118776 0.122211 0.129177
qa: -0.0551 -0.0633 -0.0501 0.9093 -0.3341 -0.3273 -0.3254 -0.5226 0.0625 0.0831 0.0098 -0.1198 -0.1277 -0.1373 0.0817 -0.0128 -0.1250 -0.1484 0.1222 0.1148 0.1235 0.1258 0.1102 0.1197 0.1161 0.1188 0.1222 0.1292
va: 1.2645 1.2415 1.2734 5.6300 2.1038 2.1246 2.1107 2.0878 3.6849 3.8545 3.9709 3.9710 4.0368 4.0144 3.9458 4.1014 3.8678 3.8643 1.0108 1.0230 1.0118 1.0169 0.9883 0.9954 0.9903 0.9894 0.9935 0.9923
dispcorr: -0.015442628 hartree
energy: -2410.148892349151
dipole: -22.06536 21.42319 -0.64216 -5.91733 5.50149 -0.41584 -3.05893 2.36322 -0.69570
magnitude: 1.03407 au
magnitude: 2.62840 debye
