program: Orca
programVersion: 5.0.4
elementType: S S P O O O N C C C C C H H H H H H H H H H H H
charge: 0
multiplicity: 1
keywords: wb97x-d3
keywords: def2-TZVPP
keywords: def2/J RIJCOSX
keywords: DEFGRID2
keywords: scfconv7
keywords: smallprint printgap noloewdin
keywords: NOSOSCF
formula: C5H12NO3PS2
InChI: InChI=1/C5H12NO3PS2/c1-6-5(7)4-12-10(11,8-2)9-3/h6H,4H2,1-3H3
24 atoms
S  0.796801 1.263945 0.95721
S  -2.489426 1.422481 0.728124
P  -0.983392 0.232561 0.656067
O  -0.804928 -0.616157 -0.693417
O  -0.884989 -0.926333 1.751857
O  2.571816 -1.776851 -0.77708
N  2.191463 0.276105 -1.622279
C  2.025939 -0.070377 0.780751
C  2.260324 -0.599565 -0.621528
C  -1.107758 -0.031106 -1.965587
C  -1.946081 -1.889576 1.868048
C  2.367497 -0.113073 -3.002299
H  2.960247 0.365482 1.145296
H  1.781335 -0.897315 1.443444
H  1.859681 1.209445 -1.434158
H  -0.626077 0.93957 -2.096004
H  -2.18493 0.085376 -2.084301
H  -0.73265 -0.718184 -2.719999
H  -1.942978 -2.575766 1.022119
H  -2.917099 -1.398224 1.936117
H  -1.762678 -2.444591 2.783702
H  3.415943 -0.30487 -3.23814
H  2.019946 0.69883 -3.635597
H  1.791054 -1.006283 -3.243451
elementType: S P O N C H
totalener: -1616.12402707 hartree
nucrepener: 1168.76526657 hartree
electener: -2784.88929363 hartree
oneelecener: -4551.05435248 hartree
twoeener: 1766.16505884 hartree
cpcmener: -0.03689804 hartree
kineticenergy: 1611.95758285 hartree
xcener: -99.849759929817 hartree
chargesum: 0.0000000
charge: -0.151034 -0.440254 0.630073 -0.337686 -0.342909 -0.562028 -0.197652 -0.079766 0.319299 -0.124056 -0.106090 -0.176607 0.154853 0.127334 0.184168 0.117129 0.133995 0.134355 0.126567 0.106114 0.129167 0.124630 0.124406 0.105994
qa: -0.1510 -0.4403 0.6301 -0.3377 -0.3429 -0.5620 -0.1977 -0.0798 0.3193 -0.1241 -0.1061 -0.1766 0.1549 0.1273 0.1842 0.1171 0.1340 0.1344 0.1266 0.1061 0.1292 0.1246 0.1244 0.1060
va: 2.2962 2.0308 5.4128 2.0468 2.0801 1.9417 3.1528 3.8353 4.1718 3.8304 3.8400 3.8836 0.9967 1.0398 1.0153 0.9908 1.0048 0.9888 0.9919 1.0023 0.9893 0.9936 0.9945 0.9961
dispcorr: -0.011454828 hartree
energy: -1616.135481894837
dipole: 4.07149 -3.76519 0.30630 -6.25533 6.67637 0.42105 -10.61430 9.39562 -1.21868
magnitude: 1.32525 au
magnitude: 3.36851 debye
