program: Orca
programVersion: 5.0.4
elementType: S S P O O O N C C C C C H H H H H H H H H H H H
charge: 0
multiplicity: 1
keywords: wb97x-d3
keywords: def2-TZVPP
keywords: def2/J RIJCOSX
keywords: DEFGRID2
keywords: scfconv7
keywords: smallprint printgap noloewdin
keywords: NOSOSCF
formula: C5H12NO3PS2
InChI: InChI=1/C5H12NO3PS2/c1-6-5(7)4-12-10(11,8-2)9-3/h6H,4H2,1-3H3
24 atoms
S  0.689737 0.373086 1.387314
S  -2.428992 1.384431 1.169658
P  -1.192871 0.065803 0.530568
O  -0.959969 -0.05224 -1.044692
O  -1.541585 -1.475585 0.774691
O  2.365173 -1.521289 -1.655213
N  2.183188 0.688867 -1.267128
C  1.677509 -0.890988 0.521883
C  2.086246 -0.591841 -0.910032
C  -1.009023 1.116475 -1.870096
C  -1.844629 -1.934047 2.094834
C  2.584793 1.093764 -2.59217
H  2.586727 -1.002191 1.119256
H  1.1684 -1.853228 0.551588
H  1.950901 1.407422 -0.600321
H  -0.621256 0.823478 -2.841692
H  -0.400678 1.929477 -1.474102
H  -2.035933 1.46206 -1.980885
H  -2.701253 -1.401605 2.509693
H  -0.989851 -1.817482 2.763054
H  -2.086759 -2.990199 2.009499
H  2.389041 2.156449 -2.704109
H  2.021829 0.561858 -3.358206
H  3.647908 0.922154 -2.767495
elementType: S P O N C H
totalener: -1616.12873968 hartree
nucrepener: 1168.15075292 hartree
electener: -2784.27949261 hartree
oneelecener: -4549.61466068 hartree
twoeener: 1765.33516807 hartree
cpcmener: -0.03051954 hartree
kineticenergy: 1611.98030460 hartree
xcener: -99.854263856437 hartree
chargesum: 0.0000000
charge: -0.167992 -0.428454 0.617635 -0.331550 -0.329805 -0.526326 -0.207418 -0.067772 0.302576 -0.128429 -0.111292 -0.172952 0.148514 0.126256 0.181176 0.133210 0.111475 0.137880 0.118040 0.113890 0.131427 0.119535 0.107430 0.122946
qa: -0.1680 -0.4285 0.6176 -0.3316 -0.3298 -0.5263 -0.2074 -0.0678 0.3026 -0.1284 -0.1113 -0.1730 0.1485 0.1263 0.1812 0.1332 0.1115 0.1379 0.1180 0.1139 0.1314 0.1195 0.1074 0.1229
va: 2.2888 2.0429 5.4472 2.0933 2.0875 1.9935 3.1335 3.8431 4.2133 3.8365 3.8365 3.8879 0.9995 1.0384 1.0186 0.9892 0.9927 1.0029 1.0012 0.9932 0.9909 0.9954 0.9965 0.9943
dispcorr: -0.011471318 hartree
energy: -1616.140211002187
dipole: 6.53500 -5.76093 0.77407 -0.18898 1.04173 0.85275 -7.38730 7.63742 0.25011
magnitude: 1.17852 au
magnitude: 2.99557 debye
