program: Orca
programVersion: 5.0.4
elementType: S S P O O O N C C C C C H H H H H H H H H H H H
charge: 0
multiplicity: 1
keywords: wb97x-d3
keywords: def2-TZVPP
keywords: def2/J RIJCOSX
keywords: DEFGRID2
keywords: scfconv7
keywords: smallprint printgap noloewdin
keywords: NOSOSCF
formula: C5H12NO3PS2
InChI: InChI=1/C5H12NO3PS2/c1-6-5(7)4-12-10(11,8-2)9-3/h6H,4H2,1-3H3
24 atoms
S  0.575357 1.648441 0.095648
S  -2.681026 1.184733 0.395481
P  -0.966127 0.337767 0.572304
O  -0.737654 -0.988178 -0.300868
O  -0.516226 -0.178852 2.013634
O  2.668217 -1.616838 -0.15231
N  2.005861 -0.311816 -1.862497
C  2.052188 0.616473 0.383048
C  2.251983 -0.547078 -0.57195
C  -1.249402 -1.080606 -1.632178
C  -1.304637 -1.147882 2.719503
C  2.173256 -1.323352 -2.876822
H  2.895057 1.306167 0.283443
H  2.057029 0.24947 1.40678
H  1.684272 0.598894 -2.147955
H  -0.93494 -0.238715 -2.250335
H  -2.338258 -1.128894 -1.623796
H  -0.853774 -2.000286 -2.055587
H  -0.968603 -1.129652 3.753041
H  -1.152297 -2.145065 2.307808
H  -2.365892 -0.897355 2.686907
H  3.224694 -1.506126 -3.103328
H  1.682007 -0.98987 -3.785953
H  1.721472 -2.266022 -2.573357
elementType: S P O N C H
totalener: -1616.12757702 hartree
nucrepener: 1171.31008351 hartree
electener: -2787.43766053 hartree
oneelecener: -4556.31068530 hartree
twoeener: 1768.87302477 hartree
cpcmener: -0.03047255 hartree
kineticenergy: 1611.97786269 hartree
xcener: -99.852405197989 hartree
chargesum: -0.0000000
charge: -0.152166 -0.433507 0.621567 -0.327158 -0.334681 -0.517094 -0.198734 -0.086011 0.292363 -0.125152 -0.107204 -0.175351 0.154731 0.126202 0.176958 0.114467 0.132172 0.130970 0.126569 0.125214 0.105796 0.123660 0.121097 0.105290
qa: -0.1522 -0.4335 0.6216 -0.3272 -0.3347 -0.5171 -0.1987 -0.0860 0.2924 -0.1252 -0.1072 -0.1754 0.1547 0.1262 0.1770 0.1145 0.1322 0.1310 0.1266 0.1252 0.1058 0.1237 0.1211 0.1053
va: 2.2880 2.0395 5.4230 2.0523 2.0878 1.9951 3.1280 3.8178 4.1995 3.8378 3.8442 3.8860 0.9965 1.0406 1.0144 0.9920 1.0056 0.9884 0.9895 0.9918 1.0033 0.9942 0.9945 0.9967
dispcorr: -0.011486259 hartree
energy: -1616.139063283333
dipole: 5.08884 -4.61105 0.47779 -9.96173 9.79690 -0.16483 -7.24050 5.85722 -1.38328
magnitude: 1.47273 au
magnitude: 3.74338 debye
