program: Orca
programVersion: 5.0.4
elementType: S S P O O O N C C C C C H H H H H H H H H H H H
charge: 0
multiplicity: 1
keywords: wb97x-d3
keywords: def2-TZVPP
keywords: def2/J RIJCOSX
keywords: DEFGRID2
keywords: scfconv7
keywords: smallprint printgap noloewdin
keywords: NOSOSCF
formula: C5H12NO3PS2
InChI: InChI=1/C5H12NO3PS2/c1-6-5(7)4-12-10(11,8-2)9-3/h6H,4H2,1-3H3
24 atoms
S  0.365764 1.585142 -0.594828
S  -2.742961 1.10555 0.378801
P  -0.950103 0.433278 0.526248
O  -0.737742 -1.096824 0.089934
O  -0.256903 0.430926 1.962803
O  2.546899 -1.381675 0.354798
N  1.960933 -0.917609 -1.770612
C  1.992772 0.883229 -0.150397
C  2.184498 -0.582842 -0.496645
C  -1.316404 -1.587151 -1.121572
C  -0.767211 -0.403357 3.013598
C  2.084352 -2.273809 -2.247556
H  2.708756 1.491916 -0.709296
H  2.185213 1.037536 0.908591
H  1.681344 -0.205253 -2.426644
H  -2.405389 -1.58495 -1.061623
H  -0.967445 -2.609192 -1.2458
H  -1.004565 -0.996682 -1.985076
H  -0.395892 -1.421863 2.906072
H  -1.858287 -0.409945 3.027904
H  -0.406301 0.015747 3.949331
H  1.597549 -2.348434 -3.216845
H  1.601747 -2.976347 -1.56834
H  3.128793 -2.572827 -2.362502
elementType: S P O N C H
totalener: -1616.12718119 hartree
nucrepener: 1175.78665080 hartree
electener: -2791.91383198 hartree
oneelecener: -4565.52440373 hartree
twoeener: 1773.61057175 hartree
cpcmener: -0.03191895 hartree
kineticenergy: 1611.95859545 hartree
xcener: -99.848375310891 hartree
chargesum: 0.0000000
charge: -0.148091 -0.433958 0.618561 -0.322350 -0.336150 -0.513064 -0.194190 -0.096963 0.287231 -0.126947 -0.103456 -0.173519 0.158325 0.126487 0.179097 0.130619 0.130651 0.113517 0.121463 0.107214 0.125936 0.121788 0.104456 0.123345
qa: -0.1481 -0.4340 0.6186 -0.3223 -0.3361 -0.5131 -0.1942 -0.0970 0.2872 -0.1269 -0.1035 -0.1735 0.1583 0.1265 0.1791 0.1306 0.1307 0.1135 0.1215 0.1072 0.1259 0.1218 0.1045 0.1233
va: 2.2882 2.0447 5.4284 2.0509 2.0892 1.9918 3.1362 3.8130 4.1807 3.8421 3.8450 3.8843 0.9983 1.0374 1.0074 1.0063 0.9870 0.9923 0.9934 1.0042 0.9897 0.9939 0.9961 0.9941
dispcorr: -0.011700694 hartree
energy: -1616.138881878866
dipole: 6.32995 -5.49709 0.83286 -12.02191 11.29125 -0.73065 -4.31521 2.66931 -1.64590
magnitude: 1.98406 au
magnitude: 5.04307 debye
