program: Orca
programVersion: 5.0.4
elementType: S S P O O O N C C C C C H H H H H H H H H H H H
charge: 0
multiplicity: 1
keywords: wb97x-d3
keywords: def2-TZVPP
keywords: def2/J RIJCOSX
keywords: DEFGRID2
keywords: scfconv7
keywords: smallprint printgap noloewdin
keywords: NOSOSCF
formula: C5H12NO3PS2
InChI: InChI=1/C5H12NO3PS2/c1-6-5(7)4-12-10(11,8-2)9-3/h6H,4H2,1-3H3
24 atoms
S  0.034147 -1.36945 -0.632472
S  -0.224396 1.293887 1.522442
P  -1.088969 -0.212651 0.678656
O  -2.368976 0.145289 -0.222625
O  -1.707445 -1.303971 1.664547
O  3.12696 -0.576406 -2.066534
N  2.127682 1.206452 -1.076323
C  1.756965 -0.990137 -0.157871
C  2.418174 -0.103735 -1.205548
C  -2.275975 1.193691 -1.179588
C  -2.562465 -0.901223 2.734243
C  2.602563 2.215108 -1.987029
H  1.765527 -0.541229 0.836285
H  2.279995 -1.942992 -0.120161
H  1.510998 1.488734 -0.327743
H  -1.473349 1.005289 -1.896691
H  -2.101582 2.154074 -0.692249
H  -3.224763 1.221335 -1.709347
H  -2.091652 -0.129666 3.345061
H  -2.736769 -1.785141 3.341774
H  -3.515997 -0.531647 2.356172
H  1.772869 2.725282 -2.479424
H  3.218162 1.746105 -2.749044
H  3.205529 2.961881 -1.468561
totalener: -1616.10799415 hartree
nucrepener: 1149.96424961 hartree
electener: -2766.07224376 hartree
oneelecener: -4513.07439166 hartree
twoeener: 1747.00214790 hartree
kineticenergy: 1612.02453749 hartree
xcener: -99.857210252104 hartree
chargesum: 0.0000000
charge: -0.107305 -0.423205 0.630416 -0.317735 -0.306562 -0.395368 -0.243135 -0.138212 0.283234 -0.121869 -0.134635 -0.151885 0.115580 0.139902 0.170760 0.102194 0.114693 0.121710 0.111619 0.120411 0.117794 0.093995 0.114067 0.103532
qa: -0.1073 -0.4232 0.6304 -0.3177 -0.3066 -0.3954 -0.2431 -0.1382 0.2832 -0.1219 -0.1346 -0.1519 0.1156 0.1399 0.1708 0.1022 0.1147 0.1217 0.1116 0.1204 0.1178 0.0940 0.1141 0.1035
va: 2.3144 2.0249 5.3955 2.0949 2.1428 2.1278 3.1247 3.7912 4.2161 3.8730 3.8812 3.8723 1.0451 1.0271 1.0508 0.9962 0.9993 0.9940 0.9984 0.9895 0.9889 0.9930 1.0261 0.9938
dispcorr: -0.009735490 hartree
energy: -1616.117729637341
dipole: -0.17857 -1.11125 -1.28982 7.77693 -7.06192 0.71501 -2.17500 2.79946 0.62446
magnitude: 1.60151 au
magnitude: 4.07071 debye
