program: Orca
programVersion: 5.0.4
elementType: S S P O O O N C C C C C H H H H H H H H H H H H
charge: 0
multiplicity: 1
keywords: wb97x-d3
keywords: def2-TZVPP
keywords: def2/J RIJCOSX
keywords: DEFGRID2
keywords: scfconv7
keywords: smallprint printgap noloewdin
keywords: NOSOSCF
formula: C5H12NO3PS2
InChI: InChI=1/C5H12NO3PS2/c1-6-5(7)4-12-10(11,8-2)9-3/h6H,4H2,1-3H3
24 atoms
S  0.069351 -1.443314 -0.381951
S  -0.80133 1.840878 0.06289
P  -1.315482 -0.015432 0.206837
O  -2.632183 -0.43464 -0.590528
O  -1.667541 -0.530147 1.684911
O  3.385543 -0.849296 -1.689249
N  2.503268 0.729604 -0.316234
C  1.015859 -0.583027 -1.687156
C  2.433757 -0.254537 -1.233373
C  -3.802672 0.378776 -0.542482
C  -0.809633 -0.198573 2.770996
C  3.740034 1.198726 0.250199
H  1.067613 -1.264047 -2.533222
H  0.475941 0.315452 -1.990684
H  1.645833 1.182339 -0.032297
H  -4.506953 -0.05294 -1.248598
H  -3.580071 1.405935 -0.833344
H  -4.245678 0.373418 0.453878
H  -0.754349 0.881723 2.910427
H  0.197244 -0.591063 2.613843
H  -1.235721 -0.658948 3.658502
H  3.743737 1.087873 1.335635
H  3.909724 2.249799 0.011325
H  4.562184 0.617732 -0.15736
totalener: -1616.10784082 hartree
nucrepener: 1147.45507199 hartree
electener: -2763.56291282 hartree
oneelecener: -4508.05343017 hartree
twoeener: 1744.49051735 hartree
kineticenergy: 1612.03126157 hartree
xcener: -99.858740620516 hartree
chargesum: 0.0000000
charge: -0.113640 -0.422090 0.629431 -0.306385 -0.317699 -0.393792 -0.243958 -0.128365 0.281438 -0.134841 -0.122119 -0.153153 0.137368 0.113924 0.169399 0.121257 0.113260 0.116708 0.115059 0.104289 0.121484 0.096833 0.102525 0.113068
qa: -0.1136 -0.4221 0.6294 -0.3064 -0.3177 -0.3938 -0.2440 -0.1284 0.2814 -0.1348 -0.1221 -0.1532 0.1374 0.1139 0.1694 0.1213 0.1133 0.1167 0.1151 0.1043 0.1215 0.0968 0.1025 0.1131
va: 2.3097 2.0217 5.4020 2.1379 2.1001 2.1294 3.1195 3.7861 4.2230 3.8803 3.8695 3.8722 1.0294 1.0425 1.0532 0.9894 0.9993 0.9881 1.0000 0.9953 0.9933 0.9929 0.9937 1.0263
dispcorr: -0.009538196 hartree
energy: -1616.117379020628
dipole: 2.91809 -4.14433 -1.22624 4.93270 -4.35680 0.57590 4.59484 -3.61272 0.98212
magnitude: 1.67329 au
magnitude: 4.25315 debye
