program: Orca
programVersion: 5.0.4
elementType: S S P O O O N C C C C C H H H H H H H H H H H H
charge: 0
multiplicity: 1
keywords: wb97x-d3
keywords: def2-TZVPP
keywords: def2/J RIJCOSX
keywords: DEFGRID2
keywords: scfconv7
keywords: smallprint printgap noloewdin
keywords: NOSOSCF
formula: C5H12NO3PS2
InChI: InChI=1/C5H12NO3PS2/c1-6-5(7)4-12-10(11,8-2)9-3/h6H,4H2,1-3H3
24 atoms
S  0.051696 -1.326818 -0.270058
S  -0.346329 1.739675 1.195637
P  -1.124189 0.024387 0.818217
O  -2.455457 -0.012505 -0.077912
O  -1.609764 -0.713818 2.142852
O  3.441913 -0.826104 -1.423341
N  2.120812 1.004658 -1.180872
C  1.748845 -0.897492 0.254778
C  2.532501 -0.24102 -0.877334
C  -2.517497 0.717771 -1.298416
C  -2.22522 -1.998951 2.128595
C  2.708219 1.800485 -2.22571
H  1.70168 -0.252045 1.133749
H  2.24084 -1.827947 0.527404
H  1.371882 1.408411 -0.635657
H  -2.393192 1.786364 -1.118426
H  -3.500358 0.533013 -1.724215
H  -1.754042 0.380634 -2.002754
H  -2.297206 -2.318955 3.164844
H  -1.623971 -2.722616 1.57442
H  -3.224853 -1.953114 1.696692
H  1.965335 2.074692 -2.976218
H  3.493314 1.229162 -2.712027
H  3.145749 2.71625 -1.825639
totalener: -1616.10725006 hartree
nucrepener: 1149.35452880 hartree
electener: -2765.46177886 hartree
oneelecener: -4511.79450526 hartree
twoeener: 1746.33272640 hartree
kineticenergy: 1612.01633624 hartree
xcener: -99.857574360148 hartree
chargesum: 0.0000000
charge: -0.163310 -0.380569 0.636034 -0.323947 -0.297562 -0.394403 -0.241799 -0.129001 0.285755 -0.125576 -0.131672 -0.152365 0.118410 0.134736 0.163189 0.116239 0.120781 0.106404 0.121097 0.106042 0.119728 0.096514 0.112904 0.102372
qa: -0.1633 -0.3806 0.6360 -0.3239 -0.2976 -0.3944 -0.2418 -0.1290 0.2858 -0.1256 -0.1317 -0.1524 0.1184 0.1347 0.1632 0.1162 0.1208 0.1064 0.1211 0.1060 0.1197 0.0965 0.1129 0.1024
va: 2.2757 2.0669 5.3967 2.0883 2.1530 2.1291 3.1129 3.7994 4.2186 3.8761 3.8740 3.8715 1.0409 1.0297 1.0658 0.9984 0.9932 0.9945 0.9901 0.9990 0.9900 0.9930 1.0261 0.9938
dispcorr: -0.009675694 hartree
energy: -1616.116925755455
dipole: 0.12367 -1.58474 -1.46107 1.07976 -1.18096 -0.10120 -6.23381 6.15185 -0.08196
magnitude: 1.46686 au
magnitude: 3.72846 debye
