program: Orca
programVersion: 5.0.4
elementType: P O O O O O N C C C C C C C C H H H H H H H H H H H H H H H H
charge: 0
multiplicity: 1
keywords: wb97x-d3
keywords: def2-TZVPP
keywords: def2/J RIJCOSX
keywords: DEFGRID2
keywords: scfconv7
keywords: smallprint printgap noloewdin
keywords: NOSOSCF
formula: C8H16NO5P
InChI: InChI=1/C8H16NO5P/c1-7(6-8(10)9(2)3)14-15(11,12-4)13-5/h6H,1-5H3
31 atoms
P  -2.191269 0.593376 -0.240248
O  -0.905709 0.263064 -1.158561
O  -2.80438 -0.807166 0.189215
O  -1.64642 1.172296 1.12339
O  -3.072806 1.516141 -0.978023
O  2.346389 -1.205995 1.186634
N  3.586933 0.369647 0.145344
C  0.213557 -0.405827 -0.676959
C  1.210998 0.337123 -0.202911
C  2.424688 -0.244766 0.416605
C  0.143523 -1.883025 -0.831795
C  4.803538 -0.02604 0.824365
C  3.747763 1.368044 -0.893071
C  -3.532221 -1.603672 -0.758044
C  -1.303839 0.405393 2.289304
H  1.115367 1.416945 -0.217155
H  -0.470718 -2.333773 -0.049563
H  -0.313229 -2.131408 -1.789988
H  1.125702 -2.34399 -0.793427
H  4.58842 -0.459998 1.796055
H  5.373683 -0.749615 0.23807
H  5.428118 0.852794 0.977912
H  2.927439 1.34151 -1.604423
H  3.821002 2.374755 -0.477835
H  4.662426 1.162338 -1.448868
H  -2.899708 -1.8998 -1.594694
H  -4.402208 -1.064556 -1.130988
H  -3.862056 -2.492979 -0.229242
H  -2.195311 -0.025739 2.740502
H  -0.85202 1.102454 2.989278
H  -0.585095 -0.381384 2.064184
elementType: P O N C H
totalener: -1086.92831966 hartree
nucrepener: 1261.58462637 hartree
electener: -2348.51294603 hartree
oneelecener: -3998.13080325 hartree
twoeener: 1649.61785722 hartree
cpcmener: -0.04775742 hartree
kineticenergy: 1082.88093215 hartree
xcener: -86.057396816893 hartree
chargesum: 0.0000000
charge: 0.928482 -0.344392 -0.332254 -0.348430 -0.650464 -0.592851 -0.110392 0.216013 -0.271134 0.399158 -0.265431 -0.175887 -0.178162 -0.119948 -0.103191 0.159024 0.116030 0.118851 0.107574 0.101042 0.117954 0.113404 0.121193 0.118523 0.112974 0.124636 0.127593 0.130276 0.129385 0.133207 0.117214
qa: 0.9285 -0.3444 -0.3323 -0.3484 -0.6505 -0.5929 -0.1104 0.2160 -0.2711 0.3992 -0.2654 -0.1759 -0.1782 -0.1199 -0.1032 0.1590 0.1160 0.1189 0.1076 0.1010 0.1180 0.1134 0.1212 0.1185 0.1130 0.1246 0.1276 0.1303 0.1294 0.1332 0.1172
va: 5.5909 2.0765 2.0614 2.0783 1.9738 1.8878 3.2156 3.7074 3.8810 4.0844 3.9820 3.8921 3.8976 3.8294 3.8089 1.0025 0.9947 1.0015 1.0178 1.0149 0.9868 0.9915 0.9914 0.9866 0.9897 0.9840 0.9985 0.9881 0.9951 0.9895 0.9956
dispcorr: -0.014116469 hartree
energy: -1086.942436127839
dipole: 15.04397 -13.21245 1.83153 -6.29145 5.35867 -0.93278 1.36695 -1.44169 -0.07474
magnitude: 2.05673 au
magnitude: 5.22780 debye
