program: Orca
programVersion: 5.0.4
elementType: P O O O O O N C C C C C C C C H H H H H H H H H H H H H H H H
charge: 0
multiplicity: 1
keywords: wb97x-d3
keywords: def2-TZVPP
keywords: def2/J RIJCOSX
keywords: DEFGRID2
keywords: scfconv7
keywords: smallprint printgap noloewdin
keywords: NOSOSCF
formula: C8H16NO5P
InChI: InChI=1/C8H16NO5P/c1-7(6-8(10)9(2)3)14-15(11,12-4)13-5/h6H,1-5H3
31 atoms
P  -2.094733 -0.277956 -0.333772
O  -0.851078 -1.194641 0.118424
O  -3.132713 -0.819779 0.730644
O  -1.75968 1.193639 0.168333
O  -2.458656 -0.376179 -1.763579
O  2.710426 0.792251 -1.15763
N  3.533807 0.259196 0.882884
C  0.422112 -0.898055 -0.369373
C  1.215267 -0.163208 0.405595
C  2.55059 0.318841 -0.029653
C  0.716969 -1.508583 -1.692448
C  4.827986 0.85886 0.634472
C  3.4002 -0.398974 2.166697
C  -4.475378 -0.31026 0.726422
C  -1.280503 2.209398 -0.726163
H  0.852811 0.159835 1.375166
H  0.356452 -2.537309 -1.713733
H  0.210004 -0.968951 -2.494834
H  1.780291 -1.515052 -1.911366
H  4.812046 1.470387 -0.261306
H  5.107675 1.492235 1.477256
H  5.596361 0.092462 0.518582
H  2.598361 -1.131677 2.158913
H  4.324034 -0.931409 2.391592
H  3.21668 0.316072 2.970965
H  -4.49151 0.744893 0.997805
H  -5.026147 -0.878051 1.470317
H  -4.94699 -0.444295 -0.246725
H  -0.251193 2.011423 -1.025066
H  -1.318141 3.147248 -0.178668
H  -1.908655 2.289552 -1.611847
elementType: P O N C H
totalener: -1086.92765996 hartree
nucrepener: 1251.53536004 hartree
electener: -2338.46302000 hartree
oneelecener: -3978.60092997 hartree
twoeener: 1640.13790997 hartree
cpcmener: -0.04308508 hartree
kineticenergy: 1082.87958416 hartree
xcener: -86.053853948025 hartree
chargesum: 0.0000000
charge: 0.972415 -0.349785 -0.352209 -0.355551 -0.642653 -0.590530 -0.106305 0.210958 -0.280237 0.393026 -0.236702 -0.170680 -0.177619 -0.120633 -0.095627 0.159914 0.115578 0.106234 0.098865 0.101383 0.114804 0.114862 0.122591 0.109913 0.119885 0.126599 0.130071 0.119176 0.113315 0.130203 0.118740
qa: 0.9724 -0.3498 -0.3522 -0.3556 -0.6427 -0.5905 -0.1063 0.2110 -0.2802 0.3930 -0.2367 -0.1707 -0.1776 -0.1206 -0.0956 0.1599 0.1156 0.1062 0.0989 0.1014 0.1148 0.1149 0.1226 0.1099 0.1199 0.1266 0.1301 0.1192 0.1133 0.1302 0.1187
va: 5.5754 2.1083 2.1197 2.0643 1.9455 1.8896 3.2217 3.7431 3.8872 4.0826 3.9797 3.8794 3.8926 3.8377 3.8132 1.0023 1.0040 1.0078 1.0157 1.0245 0.9900 0.9893 0.9913 0.9920 0.9873 0.9893 0.9896 0.9930 0.9958 0.9911 1.0020
dispcorr: -0.013165107 hartree
energy: -1086.940825063521
dipole: 12.26510 -11.63828 0.62682 3.76382 -3.32552 0.43829 4.61320 -1.94825 2.66495
magnitude: 2.77253 au
magnitude: 7.04722 debye
