program: Orca
programVersion: 5.0.4
elementType: P O O O O O N C C C C C C C C H H H H H H H H H H H H H H H H
charge: 0
multiplicity: 1
keywords: wb97x-d3
keywords: def2-TZVPP
keywords: def2/J RIJCOSX
keywords: DEFGRID2
keywords: scfconv7
keywords: smallprint printgap noloewdin
keywords: NOSOSCF
formula: C8H16NO5P
InChI: InChI=1/C8H16NO5P/c1-7(6-8(10)9(2)3)14-15(11,12-4)13-5/h6H,1-5H3
31 atoms
P  -2.169682 0.407747 0.366203
O  -0.754476 0.911435 0.925551
O  -1.940235 -0.150508 -1.104273
O  -2.389965 -0.923847 1.198292
O  -3.170793 1.483454 0.498813
O  2.582326 -1.656007 0.041915
N  3.421081 0.156545 -1.01749
C  0.422765 0.171013 0.901389
C  1.170733 0.236754 -0.197962
C  2.446874 -0.498567 -0.362409
C  0.707349 -0.526379 2.183418
C  4.649827 -0.51773 -1.380695
C  3.373134 1.57343 -1.322893
C  -1.985032 0.729952 -2.236746
C  -3.532037 -1.759491 0.947958
H  0.829551 0.846191 -1.027149
H  0.414532 0.103202 3.023436
H  0.139704 -1.455745 2.257576
H  1.760094 -0.76942 2.288441
H  5.449368 -0.308408 -0.666738
H  4.507129 -1.592588 -1.435625
H  4.972927 -0.169568 -2.361407
H  3.086496 1.756808 -2.360245
H  2.684373 2.101651 -0.669845
H  4.360627 2.005188 -1.162836
H  -1.759883 0.123334 -3.109502
H  -1.241599 1.522892 -2.155118
H  -2.975489 1.168056 -2.351236
H  -3.422467 -2.289786 0.002993
H  -4.454291 -1.179268 0.937868
H  -3.575648 -2.480027 1.759678
elementType: P O N C H
totalener: -1086.92982281 hartree
nucrepener: 1250.25992795 hartree
electener: -2337.18975076 hartree
oneelecener: -3975.76992358 hartree
twoeener: 1638.58017283 hartree
cpcmener: -0.04847284 hartree
kineticenergy: 1082.87480318 hartree
xcener: -86.053844787583 hartree
chargesum: -0.0000000
charge: 0.941923 -0.352106 -0.348825 -0.337856 -0.643876 -0.587400 -0.109515 0.260021 -0.307779 0.380806 -0.242349 -0.174834 -0.184307 -0.116343 -0.111242 0.168169 0.112379 0.110118 0.100056 0.117444 0.099770 0.113907 0.119974 0.122582 0.114053 0.132173 0.124279 0.128139 0.123377 0.120523 0.126739
qa: 0.9419 -0.3521 -0.3488 -0.3379 -0.6439 -0.5874 -0.1095 0.2600 -0.3078 0.3808 -0.2423 -0.1748 -0.1843 -0.1163 -0.1112 0.1682 0.1124 0.1101 0.1001 0.1174 0.0998 0.1139 0.1200 0.1226 0.1141 0.1322 0.1243 0.1281 0.1234 0.1205 0.1267
va: 5.5944 2.1202 2.0573 2.1007 1.9654 1.9049 3.1731 3.6941 3.9387 4.1286 3.9642 3.8907 3.8962 3.8210 3.8368 0.9814 1.0053 1.0048 1.0157 0.9866 1.0177 0.9908 0.9856 0.9891 0.9912 0.9889 0.9841 0.9987 0.9916 0.9924 0.9894
dispcorr: -0.012876121 hartree
energy: -1086.942698930757
dipole: 12.70489 -11.62294 1.08194 -1.05151 1.50250 0.45099 -6.74542 4.97974 -1.76568
magnitude: 2.11935 au
magnitude: 5.38695 debye
