program: Orca
programVersion: 5.0.4
elementType: P O O O O O N C C C C C C C C H H H H H H H H H H H H H H H H
charge: 0
multiplicity: 1
keywords: wb97x-d3
keywords: def2-TZVPP
keywords: def2/J RIJCOSX
keywords: DEFGRID2
keywords: scfconv7
keywords: smallprint printgap noloewdin
keywords: NOSOSCF
formula: C8H16NO5P
InChI: InChI=1/C8H16NO5P/c1-7(6-8(10)9(2)3)14-15(11,12-4)13-5/h6H,1-5H3
31 atoms
P  -2.007067 -0.286474 0.412671
O  -0.948786 -0.781595 -0.693685
O  -1.546442 1.217175 0.643456
O  -3.355635 -0.266619 -0.413256
O  -2.109891 -1.121751 1.624747
O  3.00593 -0.91574 0.929471
N  3.462648 0.83509 -0.421289
C  0.377007 -1.029176 -0.346341
C  1.214728 0.007545 -0.323809
C  2.628975 -0.083462 0.100374
C  0.63932 -2.471365 -0.109462
C  4.819697 0.955169 0.067495
C  3.11798 1.705143 -1.530352
C  -1.894348 1.932303 1.839103
C  -3.521733 0.49616 -1.617736
H  0.827788 0.984019 -0.585651
H  0.258068 -2.77167 0.86928
H  0.115801 -3.067991 -0.856791
H  1.695542 -2.71289 -0.151744
H  4.919559 0.523136 1.058303
H  5.531174 0.463208 -0.598857
H  5.087822 2.009441 0.130707
H  2.350223 1.267854 -2.162264
H  2.782104 2.687013 -1.190695
H  4.000339 1.847773 -2.152619
H  -1.274231 2.824168 1.857967
H  -1.692868 1.339594 2.729751
H  -2.943714 2.2234 1.821842
H  -4.569457 0.416602 -1.893512
H  -2.91003 0.091473 -2.423088
H  -3.274723 1.545708 -1.461973
elementType: P O N C H
totalener: -1086.92915442 hartree
nucrepener: 1248.87597085 hartree
electener: -2335.80512527 hartree
oneelecener: -3973.21173991 hartree
twoeener: 1637.40661464 hartree
cpcmener: -0.04802872 hartree
kineticenergy: 1082.88080052 hartree
xcener: -86.055818240454 hartree
chargesum: -0.0000000
charge: 0.956366 -0.349504 -0.343810 -0.352028 -0.647760 -0.589572 -0.111738 0.249116 -0.297030 0.391256 -0.232949 -0.175822 -0.185717 -0.105590 -0.106373 0.152680 0.107632 0.109823 0.098623 0.100792 0.116086 0.114617 0.121128 0.120324 0.112871 0.124961 0.118474 0.129996 0.128381 0.123855 0.120910
qa: 0.9564 -0.3495 -0.3438 -0.3520 -0.6478 -0.5896 -0.1117 0.2491 -0.2970 0.3913 -0.2329 -0.1758 -0.1857 -0.1056 -0.1064 0.1527 0.1076 0.1098 0.0986 0.1008 0.1161 0.1146 0.1211 0.1203 0.1129 0.1250 0.1185 0.1300 0.1284 0.1239 0.1209
va: 5.5730 2.0957 2.0669 2.1091 1.9657 1.9044 3.1846 3.7092 3.8998 4.1233 3.9655 3.8878 3.8967 3.8286 3.8303 1.0059 1.0076 1.0038 1.0195 1.0189 0.9869 0.9904 0.9888 0.9854 0.9913 0.9893 0.9992 0.9858 0.9896 0.9909 0.9920
dispcorr: -0.012459845 hartree
energy: -1086.941614266671
dipole: 11.56657 -11.45340 0.11317 9.25549 -5.96866 3.28683 -5.77067 3.14595 -2.62472
magnitude: 4.20776 au
magnitude: 10.69527 debye
