program: Orca
programVersion: 5.0.4
elementType: P O O O O O N C C C C C C C C H H H H H H H H H H H H H H H H
charge: 0
multiplicity: 1
keywords: wb97x-d3
keywords: def2-TZVPP
keywords: def2/J RIJCOSX
keywords: DEFGRID2
keywords: scfconv7
keywords: smallprint printgap noloewdin
keywords: NOSOSCF
formula: C8H16NO5P
InChI: InChI=1/C8H16NO5P/c1-7(6-8(10)9(2)3)14-15(11,12-4)13-5/h6H,1-5H3
31 atoms
P  -2.260355 0.45017 0.164794
O  -0.828242 -0.243224 -0.112705
O  -3.144609 -0.287509 -0.921872
O  -2.811571 -0.134239 1.525657
O  -2.244067 1.924934 0.153796
O  3.107237 1.291334 0.57234
N  3.772391 -0.384126 -0.788027
C  0.39693 0.165642 0.373465
C  1.425046 -0.034117 -0.456123
C  2.823827 0.341384 -0.163988
C  0.41052 0.683818 1.767646
C  5.164881 0.007687 -0.719921
C  3.498359 -1.593461 -1.541695
C  -2.975716 -0.011279 -2.321213
C  -2.799507 -1.535333 1.837293
H  1.206778 -0.469108 -1.424121
H  -0.019279 1.686023 1.81951
H  -0.177146 0.03532 2.418722
H  1.41819 0.736259 2.16304
H  5.617142 -0.085406 -1.707267
H  5.267361 1.039254 -0.399407
H  5.724843 -0.625946 -0.029329
H  3.287669 -1.383047 -2.592462
H  4.373715 -2.239055 -1.498783
H  2.667937 -2.153205 -1.11932
H  -3.712499 -0.610615 -2.847926
H  -1.978841 -0.293033 -2.659107
H  -3.150844 1.042351 -2.535364
H  -3.475333 -2.086591 1.184876
H  -3.142015 -1.626741 2.864051
H  -1.795634 -1.951629 1.760597
elementType: P O N C H
totalener: -1086.93033460 hartree
nucrepener: 1234.28563949 hartree
electener: -2321.21597409 hartree
oneelecener: -3943.69855586 hartree
twoeener: 1622.48258176 hartree
cpcmener: -0.04905272 hartree
kineticenergy: 1082.87031002 hartree
xcener: -86.056725812714 hartree
chargesum: -0.0000000
charge: 0.934049 -0.315724 -0.346179 -0.353428 -0.635056 -0.593856 -0.113530 0.218847 -0.287858 0.386545 -0.239087 -0.173985 -0.188376 -0.108289 -0.111390 0.148701 0.117133 0.121975 0.104051 0.114617 0.099886 0.114759 0.120554 0.111848 0.121277 0.129273 0.124192 0.118744 0.129425 0.131201 0.119682
qa: 0.9340 -0.3157 -0.3462 -0.3534 -0.6351 -0.5939 -0.1135 0.2188 -0.2879 0.3865 -0.2391 -0.1740 -0.1884 -0.1083 -0.1114 0.1487 0.1171 0.1220 0.1041 0.1146 0.0999 0.1148 0.1206 0.1118 0.1213 0.1293 0.1242 0.1187 0.1294 0.1312 0.1197
va: 5.5908 2.0843 2.1076 2.0905 1.9667 1.8944 3.1696 3.7774 3.8306 4.1468 3.9113 3.8867 3.8946 3.8323 3.8237 1.0076 1.0110 0.9978 1.0278 0.9894 1.0214 0.9869 0.9846 0.9925 0.9881 0.9888 0.9893 0.9929 0.9941 0.9882 0.9894
dispcorr: -0.012488105 hartree
energy: -1086.942822706351
dipole: 13.57211 -13.21553 0.35657 -9.78953 5.90114 -3.88838 -4.10381 2.61612 -1.48769
magnitude: 4.17850 au
magnitude: 10.62091 debye
