program: Orca
programVersion: 5.0.4
elementType: P O O O O O N C C C C C C C C H H H H H H H H H H H H H H H H
charge: 0
multiplicity: 1
keywords: wb97x-d3
keywords: def2-TZVPP
keywords: def2/J RIJCOSX
keywords: DEFGRID2
keywords: scfconv7
keywords: smallprint printgap noloewdin
keywords: NOSOSCF
formula: C8H16NO5P
InChI: InChI=1/C8H16NO5P/c1-7(6-8(10)9(2)3)14-15(11,12-4)13-5/h6H,1-5H3
31 atoms
P  -2.176963 0.175385 0.243279
O  -0.726032 -0.314416 -0.251592
O  -3.066999 -0.221922 -1.006772
O  -2.542958 -0.938666 1.307448
O  -2.271162 1.582986 0.682007
O  3.304545 -0.711367 1.097778
N  3.857614 0.136815 -0.920569
C  0.497042 -0.154832 0.369078
C  1.548479 -0.279969 -0.446576
C  2.960878 -0.293202 -0.011958
C  0.485002 0.103572 1.832903
C  5.278716 -0.02599 -0.696944
C  3.498683 0.772384 -2.173605
C  -3.160251 0.656323 -2.140132
C  -3.717226 -0.800784 2.125218
H  1.344786 -0.434613 -1.499313
H  -0.13342 0.968155 2.075589
H  0.082669 -0.755314 2.373128
H  1.483272 0.297342 2.20614
H  5.46976 -0.695411 0.135057
H  5.741401 -0.450673 -1.5886
H  5.759954 0.931409 -0.489215
H  3.411842 0.051102 -2.989157
H  2.568746 1.328283 -2.091851
H  4.276907 1.486138 -2.438846
H  -3.883001 0.212027 -2.818303
H  -2.199233 0.740895 -2.646911
H  -3.507262 1.645785 -1.846069
H  -3.666932 0.100709 2.733933
H  -3.744814 -1.670555 2.774974
H  -4.619384 -0.782741 1.514691
elementType: P O N C H
totalener: -1086.92907862 hartree
nucrepener: 1225.03298019 hartree
electener: -2311.96205881 hartree
oneelecener: -3925.53832676 hartree
twoeener: 1613.57626795 hartree
cpcmener: -0.04242884 hartree
kineticenergy: 1082.87490927 hartree
xcener: -86.057111966590 hartree
chargesum: 0.0000000
charge: 0.964045 -0.312151 -0.356228 -0.350178 -0.637493 -0.594193 -0.111824 0.224631 -0.287110 0.383848 -0.260489 -0.171924 -0.185712 -0.113513 -0.113801 0.147474 0.113059 0.124703 0.105119 0.100243 0.114583 0.113551 0.120343 0.120638 0.111216 0.129867 0.126391 0.116606 0.120245 0.129686 0.128370
qa: 0.9640 -0.3122 -0.3562 -0.3502 -0.6375 -0.5942 -0.1118 0.2246 -0.2871 0.3838 -0.2605 -0.1719 -0.1857 -0.1135 -0.1138 0.1475 0.1131 0.1247 0.1051 0.1002 0.1146 0.1136 0.1203 0.1206 0.1112 0.1299 0.1264 0.1166 0.1202 0.1297 0.1284
va: 5.5792 2.1652 2.1086 2.0922 1.9421 1.8945 3.1728 3.7841 3.8002 4.1458 3.9117 3.8829 3.8929 3.8351 3.8295 1.0110 1.0166 0.9999 1.0306 1.0240 0.9891 0.9878 0.9853 0.9896 0.9922 0.9892 0.9873 0.9957 0.9944 0.9895 0.9893
dispcorr: -0.011889841 hartree
energy: -1086.940968460991
dipole: 9.81481 -10.46666 -0.65185 2.59867 -2.37938 0.21929 -4.83843 2.76165 -2.07678
magnitude: 2.18769 au
magnitude: 5.56068 debye
