program: Orca
programVersion: 5.0.4
elementType: P O O O O O N C C C C C C C C H H H H H H H H H H H H H H H H
charge: 0
multiplicity: 1
keywords: wb97x-d3
keywords: def2-TZVPP
keywords: def2/J RIJCOSX
keywords: DEFGRID2
keywords: scfconv7
keywords: smallprint printgap noloewdin
keywords: NOSOSCF
formula: C8H16NO5P
InChI: InChI=1/C8H16NO5P/c1-7(6-8(10)9(2)3)14-15(11,12-4)13-5/h6H,1-5H3
31 atoms
P  -2.122778 0.34092 -0.226657
O  -0.689075 0.084567 0.451318
O  -2.722861 -1.130756 -0.251362
O  -2.869813 1.144308 0.913443
O  -2.135021 1.071513 -1.509073
O  3.153004 -1.659477 -0.203206
N  3.93843 0.435713 0.107788
C  0.463075 -0.404501 -0.134544
C  1.598216 0.024584 0.420771
C  2.946481 -0.472036 0.063016
C  0.291362 -1.340806 -1.276276
C  5.32177 0.032905 -0.035909
C  3.726026 1.85965 0.276866
C  -3.916611 -1.408816 -0.99975
C  -2.984733 0.669618 2.26325
H  1.527646 0.751254 1.221978
H  -0.318007 -0.894748 -2.063573
H  1.246521 -1.604501 -1.715603
H  -0.201324 -2.259444 -0.954765
H  5.438888 -1.03451 0.118226
H  5.708582 0.285622 -1.024743
H  5.928718 0.551223 0.706293
H  3.859317 2.171062 1.314944
H  4.450063 2.399405 -0.332412
H  2.737142 2.160802 -0.056599
H  -4.763661 -0.843866 -0.61166
H  -4.113868 -2.470322 -0.884144
H  -3.778538 -1.182042 -2.055866
H  -2.02633 0.731794 2.777091
H  -3.353423 -0.35514 2.298575
H  -3.698615 1.319281 2.761664
elementType: P O N C H
totalener: -1086.92958617 hartree
nucrepener: 1228.84424242 hartree
electener: -2315.77382859 hartree
oneelecener: -3932.98487673 hartree
twoeener: 1617.21104814 hartree
cpcmener: -0.04572698 hartree
kineticenergy: 1082.86749295 hartree
xcener: -86.056432418639 hartree
chargesum: -0.0000000
charge: 0.927599 -0.310118 -0.342314 -0.355131 -0.637777 -0.591926 -0.110835 0.225008 -0.288011 0.380385 -0.247425 -0.171616 -0.181165 -0.111195 -0.104962 0.153726 0.109088 0.099858 0.122532 0.099880 0.115228 0.114156 0.119271 0.111619 0.121019 0.130564 0.129343 0.121604 0.122097 0.121067 0.128431
qa: 0.9276 -0.3101 -0.3423 -0.3551 -0.6378 -0.5919 -0.1108 0.2250 -0.2880 0.3804 -0.2474 -0.1716 -0.1812 -0.1112 -0.1050 0.1537 0.1091 0.0999 0.1225 0.0999 0.1152 0.1142 0.1193 0.1116 0.1210 0.1306 0.1293 0.1216 0.1221 0.1211 0.1284
va: 5.5936 2.1400 2.0558 2.1135 1.9588 1.8954 3.1711 3.7663 3.8341 4.1388 3.9255 3.8849 3.8933 3.8207 3.8314 1.0063 1.0167 1.0285 0.9995 1.0220 0.9875 0.9900 0.9860 0.9910 0.9908 0.9876 0.9902 0.9973 0.9912 0.9915 0.9896
dispcorr: -0.012332788 hartree
energy: -1086.941918962139
dipole: 9.74933 -10.23770 -0.48837 -0.33112 0.89115 0.56003 1.99871 -0.42016 1.57855
magnitude: 1.74470 au
magnitude: 4.43466 debye
