program: Orca
programVersion: 5.0.4
elementType: P O O O O O N C C C C C C C C H H H H H H H H H H H H H H H H
charge: 0
multiplicity: 1
keywords: wb97x-d3
keywords: def2-TZVPP
keywords: def2/J RIJCOSX
keywords: DEFGRID2
keywords: scfconv7
keywords: smallprint printgap noloewdin
keywords: NOSOSCF
formula: C8H16NO5P
InChI: InChI=1/C8H16NO5P/c1-7(6-8(10)9(2)3)14-15(11,12-4)13-5/h6H,1-5H3
31 atoms
P  -2.141873 0.284566 -0.000581
O  -0.94886 -0.600499 -0.637541
O  -3.366544 -0.701275 -0.176883
O  -1.956169 0.19119 1.570535
O  -2.246303 1.643862 -0.566119
O  2.63925 0.814934 1.703576
N  3.471603 -0.291774 -0.080721
C  0.363701 -0.149573 -0.607257
C  1.092346 -0.418567 0.471877
C  2.468857 0.080995 0.733476
C  0.77815 0.552568 -1.849485
C  4.799647 0.247771 0.124013
C  3.387659 -1.345542 -1.067559
C  -3.895016 -1.006321 -1.473192
C  -1.523631 1.312016 2.352803
H  0.632124 -0.927914 1.31174
H  0.702974 -0.117599 -2.708744
H  0.122315 1.402658 -2.045314
H  1.798092 0.922721 -1.791539
H  5.29774 0.345695 -0.84055
H  4.758189 1.230734 0.584647
H  5.406099 -0.407149 0.754949
H  2.43649 -1.866034 -1.016675
H  3.519383 -0.955854 -2.078779
H  4.175522 -2.079346 -0.885426
H  -4.78443 -1.610129 -1.312336
H  -3.18085 -1.579022 -2.065411
H  -4.173155 -0.100674 -2.012485
H  -0.475193 1.543649 2.163959
H  -1.639993 1.021333 3.393999
H  -2.133567 2.19389 2.161015
elementType: P O N C H
totalener: -1086.93050349 hartree
nucrepener: 1256.57347429 hartree
electener: -2343.50397778 hartree
oneelecener: -3988.23665935 hartree
twoeener: 1644.73268157 hartree
cpcmener: -0.03463754 hartree
kineticenergy: 1082.88969040 hartree
xcener: -86.053378439894 hartree
chargesum: 0.0000000
charge: 0.952488 -0.361762 -0.345885 -0.353496 -0.616135 -0.541650 -0.132378 0.194243 -0.230687 0.369670 -0.231802 -0.175132 -0.188823 -0.114329 -0.099036 0.142928 0.112392 0.110806 0.090519 0.110128 0.103640 0.117479 0.124744 0.114352 0.122417 0.126450 0.123180 0.116902 0.111812 0.127118 0.119847
qa: 0.9525 -0.3618 -0.3459 -0.3535 -0.6161 -0.5417 -0.1324 0.1942 -0.2307 0.3697 -0.2318 -0.1751 -0.1888 -0.1143 -0.0990 0.1429 0.1124 0.1108 0.0905 0.1101 0.1036 0.1175 0.1247 0.1144 0.1224 0.1265 0.1232 0.1169 0.1118 0.1271 0.1198
va: 5.5873 2.0789 2.1230 2.0859 1.9732 1.9581 3.1536 3.7237 3.9112 4.1036 3.9719 3.8894 3.8823 3.8428 3.8210 1.0124 0.9970 1.0196 1.0137 0.9931 1.0159 0.9883 0.9964 0.9855 0.9941 0.9895 0.9904 0.9927 0.9976 0.9912 0.9992
dispcorr: -0.013732049 hartree
energy: -1086.944235535252
dipole: 14.10367 -13.22611 0.87755 -2.15048 0.41581 -1.73467 -6.37760 4.67304 -1.70456
magnitude: 2.58548 au
magnitude: 6.57177 debye
