program: Orca
programVersion: 5.0.4
elementType: P O O O O O N C C C C C C C C H H H H H H H H H H H H H H H H
charge: 0
multiplicity: 1
keywords: wb97x-d3
keywords: def2-TZVPP
keywords: def2/J RIJCOSX
keywords: DEFGRID2
keywords: scfconv7
keywords: smallprint printgap noloewdin
keywords: NOSOSCF
formula: C8H16NO5P
InChI: InChI=1/C8H16NO5P/c1-7(6-8(10)9(2)3)14-15(11,12-4)13-5/h6H,1-5H3
31 atoms
P  -2.134231 0.314338 0.142591
O  -0.712922 -0.341068 0.507464
O  -2.513781 -0.478571 -1.177879
O  -3.065069 -0.37139 1.228465
O  -2.171916 1.787933 0.084557
O  3.577693 0.777633 1.30581
N  3.593543 -0.528209 -0.531628
C  0.530116 -0.016085 0.005181
C  1.558874 -0.28357 0.806718
C  2.986009 0.027727 0.53374
C  0.584938 0.547491 -1.37076
C  4.967112 -0.173917 -0.823212
C  3.069289 -1.630589 -1.308399
C  -3.655165 -0.092883 -1.955622
C  -3.195432 0.189735 2.540662
H  1.359879 -0.64665 1.809429
H  0.010204 1.472236 -1.445221
H  1.605977 0.783502 -1.657261
H  0.180065 -0.155714 -2.10084
H  5.144744 -0.2906 -1.890966
H  5.172868 0.859167 -0.558237
H  5.671728 -0.816046 -0.289305
H  3.783089 -2.457157 -1.299017
H  2.134873 -2.000183 -0.898132
H  2.904316 -1.342234 -2.348096
H  -4.577256 -0.204954 -1.385071
H  -3.686695 -0.760183 -2.812699
H  -3.566084 0.934593 -2.306705
H  -3.907353 -0.433248 3.075663
H  -3.575088 1.210111 2.499907
H  -2.2437 0.175716 3.072643
elementType: P O N C H
totalener: -1086.93108157 hartree
nucrepener: 1236.32595651 hartree
electener: -2323.25703807 hartree
oneelecener: -3947.57434917 hartree
twoeener: 1624.31731110 hartree
cpcmener: -0.03695942 hartree
kineticenergy: 1082.88934441 hartree
xcener: -86.054871526597 hartree
chargesum: -0.0000000
charge: 0.939788 -0.318984 -0.347636 -0.352286 -0.610529 -0.543708 -0.142202 0.177820 -0.218710 0.365697 -0.258638 -0.179026 -0.188109 -0.115290 -0.115017 0.132000 0.126244 0.097824 0.121999 0.108457 0.103687 0.117899 0.121908 0.122967 0.114260 0.125079 0.127518 0.119205 0.126379 0.117387 0.124016
qa: 0.9398 -0.3190 -0.3476 -0.3523 -0.6105 -0.5437 -0.1422 0.1778 -0.2187 0.3657 -0.2586 -0.1790 -0.1881 -0.1153 -0.1150 0.1320 0.1262 0.0978 0.1220 0.1085 0.1037 0.1179 0.1219 0.1230 0.1143 0.1251 0.1275 0.1192 0.1264 0.1174 0.1240
va: 5.6079 2.1501 2.0908 2.1071 1.9757 1.9538 3.1191 3.7615 3.8805 4.1184 3.9080 3.8986 3.8867 3.8372 3.8427 1.0221 1.0190 1.0178 1.0014 0.9939 1.0119 0.9883 0.9938 0.9961 0.9846 0.9899 0.9894 0.9944 0.9896 0.9948 0.9872
dispcorr: -0.012936568 hartree
energy: -1086.944018133939
dipole: 8.18415 -9.16840 -0.98424 -3.91321 1.93651 -1.97670 -8.14752 6.26736 -1.88016
magnitude: 2.90018 au
magnitude: 7.37168 debye
