program: Orca
programVersion: 5.0.4
elementType: P O O O O O N C C C C C C C C H H H H H H H H H H H H H H H H
charge: 0
multiplicity: 1
keywords: wb97x-d3
keywords: def2-TZVPP
keywords: def2/J RIJCOSX
keywords: DEFGRID2
keywords: scfconv7
keywords: smallprint printgap noloewdin
keywords: NOSOSCF
formula: C8H16NO5P
InChI: InChI=1/C8H16NO5P/c1-7(6-8(10)9(2)3)14-15(11,12-4)13-5/h6H,1-5H3
31 atoms
P  -1.818411 0.568982 0.274665
O  -0.847228 -0.451234 1.047196
O  -2.310514 -0.351341 -0.928846
O  -3.011733 0.710824 1.304515
O  -1.268489 1.88062 -0.111643
O  3.265675 -1.463551 0.310355
N  3.392575 0.580862 -0.648398
C  0.362098 -0.888331 0.522641
C  1.381999 -0.032621 0.502705
C  2.750701 -0.379723 0.045576
C  0.307735 -2.3066 0.0871
C  4.784103 0.430175 -1.011743
C  2.778198 1.819844 -1.077174
C  -2.995141 0.226288 -2.047639
C  -3.689463 -0.416774 1.87295
H  1.218818 0.971583 0.875431
H  -0.497284 -2.451646 -0.634708
H  1.238194 -2.635929 -0.362322
H  0.094795 -2.954498 0.940327
H  4.895786 0.319075 -2.092443
H  5.346169 1.313692 -0.70362
H  5.221163 -0.437879 -0.529055
H  3.008776 2.644763 -0.398556
H  3.158562 2.081361 -2.064638
H  1.69825 1.731363 -1.163266
H  -3.184104 -0.581822 -2.747944
H  -2.385969 0.985203 -2.536472
H  -3.946402 0.663344 -1.745944
H  -3.973483 -1.144647 1.112769
H  -4.59025 -0.034099 2.345769
H  -3.070052 -0.900765 2.627382
elementType: P O N C H
totalener: -1086.93346022 hartree
nucrepener: 1250.30031490 hartree
electener: -2337.23377513 hartree
oneelecener: -3975.84915057 hartree
twoeener: 1638.61537544 hartree
cpcmener: -0.03401422 hartree
kineticenergy: 1082.88810428 hartree
xcener: -86.054919608347 hartree
chargesum: -0.0000000
charge: 0.933816 -0.349241 -0.339765 -0.345394 -0.614280 -0.547120 -0.115345 0.227786 -0.266508 0.352428 -0.230596 -0.168732 -0.173058 -0.114199 -0.106899 0.157089 0.102143 0.096389 0.109078 0.110549 0.111500 0.102378 0.118112 0.107079 0.109519 0.124352 0.119695 0.124292 0.118466 0.126650 0.119816
qa: 0.9338 -0.3492 -0.3398 -0.3454 -0.6143 -0.5471 -0.1153 0.2278 -0.2665 0.3524 -0.2306 -0.1687 -0.1731 -0.1142 -0.1069 0.1571 0.1021 0.0964 0.1091 0.1105 0.1115 0.1024 0.1181 0.1071 0.1095 0.1244 0.1197 0.1243 0.1185 0.1267 0.1198
va: 5.5889 2.1047 2.0678 2.1108 2.0011 1.9552 3.1651 3.7369 3.9239 4.1750 3.9729 3.8783 3.8873 3.8429 3.8395 1.0014 1.0095 1.0265 0.9978 0.9896 0.9896 1.0271 0.9869 0.9932 1.0063 0.9900 0.9968 0.9861 0.9920 0.9902 0.9915
dispcorr: -0.012810613 hartree
energy: -1086.946270837054
dipole: 5.73638 -7.25473 -1.51835 -1.61930 1.53535 -0.08396 -7.16138 6.06626 -1.09512
magnitude: 1.87396 au
magnitude: 4.76323 debye
