program: Orca
programVersion: 5.0.4
elementType: P O O O O O N C C C C C C C C H H H H H H H H H H H H H H H H
charge: 0
multiplicity: 1
keywords: wb97x-d3
keywords: def2-TZVPP
keywords: def2/J RIJCOSX
keywords: DEFGRID2
keywords: scfconv7
keywords: smallprint printgap noloewdin
keywords: NOSOSCF
formula: C8H16NO5P
InChI: InChI=1/C8H16NO5P/c1-7(6-8(10)9(2)3)14-15(11,12-4)13-5/h6H,1-5H3
31 atoms
P  -2.095226 -0.329581 0.413453
O  -0.945084 -0.889049 -0.562635
O  -1.552977 1.136591 0.711131
O  -3.317354 -0.204224 -0.584067
O  -2.425636 -1.148368 1.592742
O  3.035147 -0.735738 0.966057
N  3.436202 0.803825 -0.63899
C  0.366077 -1.060733 -0.140337
C  1.211754 -0.059338 -0.389282
C  2.630217 -0.047435 0.030862
C  0.612319 -2.385712 0.485734
C  4.786679 1.052631 -0.184528
C  3.024182 1.556554 -1.807136
C  -1.991045 1.868008 1.863021
C  -3.244773 0.524918 -1.815385
H  0.814754 0.814865 -0.888849
H  0.011985 -3.147921 -0.011091
H  1.656522 -2.674782 0.435875
H  0.318966 -2.373819 1.538006
H  5.517185 0.685509 -0.908804
H  4.945754 2.125382 -0.057149
H  4.972616 0.565649 0.767071
H  2.518018 2.489039 -1.543937
H  3.909248 1.812112 -2.387576
H  2.3762 0.973952 -2.458267
H  -1.4320 2.801015 1.869212
H  -1.782041 1.320478 2.78212
H  -3.056882 2.092292 1.806379
H  -2.63918 -0.007709 -2.548177
H  -2.841196 1.527018 -1.66845
H  -4.261818 0.607849 -2.190027
elementType: P O N C H
totalener: -1086.93178311 hartree
nucrepener: 1248.06975034 hartree
electener: -2335.00153345 hartree
oneelecener: -3971.36854084 hartree
twoeener: 1636.36700738 hartree
cpcmener: -0.03691332 hartree
kineticenergy: 1082.88188878 hartree
xcener: -86.053640375412 hartree
chargesum: -0.0000000
charge: 0.927655 -0.343772 -0.338965 -0.343468 -0.616269 -0.549559 -0.117396 0.254873 -0.294958 0.373864 -0.239273 -0.172709 -0.192264 -0.112655 -0.107931 0.137914 0.111452 0.102997 0.109558 0.108927 0.113189 0.103595 0.119681 0.108751 0.119587 0.123927 0.120475 0.127046 0.119919 0.118250 0.127555
qa: 0.9277 -0.3438 -0.3390 -0.3435 -0.6163 -0.5496 -0.1174 0.2549 -0.2950 0.3739 -0.2393 -0.1727 -0.1923 -0.1127 -0.1079 0.1379 0.1115 0.1030 0.1096 0.1089 0.1132 0.1036 0.1197 0.1088 0.1196 0.1239 0.1205 0.1270 0.1199 0.1182 0.1276
va: 5.6007 2.1003 2.0595 2.1088 2.0064 1.9582 3.1693 3.7329 3.8785 4.1640 3.9588 3.8791 3.8971 3.8399 3.8381 1.0122 1.0049 1.0195 1.0071 0.9884 0.9881 1.0276 0.9843 0.9944 0.9877 0.9902 0.9964 0.9855 0.9910 0.9922 0.9902
dispcorr: -0.012434836 hartree
energy: -1086.944217949998
dipole: 12.16711 -11.83239 0.33472 9.36681 -6.48325 2.88356 -5.99485 3.49736 -2.49749
magnitude: 3.82941 au
magnitude: 9.73359 debye
