program: Gaussian 09
title: 000065529
version: EM64L-G09RevD.01
frameworkgroup: C1[X(C19H30O3)]
method: RPBEPBE
basis: SDD
operation: Freq
keyword: #pfreq=noraman
keyword: PBEPBE/SDD
title: #p freq=noraman PBEPBE/SDD
converged: NO YES NO NO
title: Mulliken charges:
elementType: O O O C C C C C C C C C C C C C C C C C C C H H H H H H H H H H H H H H H H H H H H H H H H H H H H H H
charge: -0.459428 -0.443098 -0.183175 -0.124277 0.355841 -0.138208 -0.144961 0.331554 -0.057398 -0.176065 -0.504163 -0.632362 -0.488721 -0.525447 -0.541410 -0.536880 -0.798350 0.045874 -0.512119 -0.438975 -0.060495 -0.812434 0.209240 0.255485 0.215074 0.189946 0.210932 0.214590 0.206915 0.226018 0.233674 0.192250 0.217570 0.234567 0.198576 0.235120 0.220547 0.230836 0.181420 0.212392 0.268946 0.193131 0.247715 0.246966 0.213988 0.212575 0.180115 0.221499 0.227068 0.279786 0.339882 0.327871
chargesum: 0.00000
title: Mulliken charges with hydrogens summed into heavy atoms:
elementType: O O O C C C C C C C C C C C C C C C C C C C
charge: -0.119546 -0.115227 -0.183175 0.084964 0.355841 0.117277 0.070113 0.331554 0.132548 0.034867 -0.082658 -0.172670 -0.078901 -0.092303 -0.085743 -0.124624 -0.123881 0.045874 -0.017437 -0.012412 0.119620 -0.084082
polarizability: 2.25439194e+02 -1.82944204e+00 1.94614479e+02 3.04146859e+00 -2.38370857e+00 1.78740400e+02
1716.lowfreq: -13.0673 -4.4338 0.0001 0.0004 0.0005 9.9720 33.9109 58.7626 71.8578
frequency: 33.8029 58.7193 71.8326 114.4670 129.1573 134.9317 163.2321 182.1404 193.5083 208.9726 230.0374 246.6536 257.4037 263.2806 267.1580 283.0838 293.9659 306.7246 315.3131 319.1462 322.1785 347.3678 355.3524 374.1774 388.1178 410.6513 451.7712 454.4484 457.9883 472.5483 491.6890 512.1491 539.3352 563.5173 571.3397 586.3289 607.5153 625.9722 675.7103 740.8663 742.4321 772.3652 799.1131 821.9032 836.7825 839.0298 850.3146 884.6123 903.8259 908.6041 919.5285 925.5034 944.5344 952.5140 976.4287 986.2436 989.4062 1007.1758 1009.6268 1014.3070 1024.8271 1027.1183 1043.3246 1049.2952 1061.5765 1063.3336 1088.6834 1095.5309 1102.7895 1105.3476 1116.2098 1134.3758 1143.4783 1147.0235 1160.9810 1176.5924 1184.5874 1197.4501 1204.1826 1217.3801 1234.9824 1240.7030 1242.9843 1247.1469 1255.2639 1259.0390 1263.3957 1280.7665 1286.2432 1287.6791 1298.6905 1309.6372 1315.1319 1318.6609 1322.6999 1328.6507 1337.6782 1341.3767 1346.7551 1349.6792 1353.7861 1354.4124 1372.6502 1379.2410 1382.7979 1393.8137 1399.1492 1426.8296 1455.1946 1462.7067 1466.1025 1469.3305 1469.7465 1473.2017 1475.7600 1480.5153 1483.2120 1496.1186 1503.5988 1652.4676 2894.3117 2918.7865 2927.7023 2936.1169 2940.9988 2953.2676 2959.8483 2963.5994 2970.8890 2976.3272 2980.8014 2983.1410 2991.3002 2993.3780 3000.0517 3007.8437 3017.5408 3023.7895 3029.7418 3033.8340 3037.5785 3052.3132 3056.4710 3069.3596 3069.9877 3075.3667 3101.6382 3111.5969 3548.5259 3550.8708
redmass: 5.3371 4.5027 4.9894 2.7542 3.1607 3.3505 3.0212 2.9748 2.5813 1.9237 2.8475 1.8570 1.2991 3.0677 2.9157 2.1992 2.1062 3.1747 1.3144 2.3542 1.2151 3.2325 2.8783 2.5758 2.9481 2.5566 2.3385 2.3339 3.0257 2.7419 3.7672 2.8335 2.3869 3.0329 3.7751 2.9724 2.9411 3.7397 3.3305 2.5844 3.6217 2.6929 2.0422 1.7735 2.5547 2.2884 2.2637 2.0723 1.8522 2.3571 2.0569 1.9815 1.7571 1.8525 2.3016 2.0438 3.0149 2.1639 2.0847 1.9666 2.0149 1.6271 2.4628 2.1133 2.2424 1.9629 2.0281 2.1934 1.4222 1.3574 2.3298 1.9375 1.7519 1.4714 2.0343 2.1535 1.6570 1.5695 1.5336 1.9310 1.6122 1.4760 1.5266 1.4050 1.4070 1.5642 1.4232 1.3856 1.3799 1.4625 1.3524 1.3548 1.4180 1.3419 1.4169 1.4629 1.3825 1.4580 1.4695 1.4207 1.4129 1.4087 1.4371 1.4008 1.2498 1.4557 1.3562 1.0809 1.0855 1.0834 1.0717 1.0724 1.0642 1.0853 1.0883 1.0832 1.0743 1.0654 1.0554 11.9631 1.0808 1.0835 1.0808 1.0818 1.0805 1.0634 1.0639 1.0663 1.0631 1.0552 1.0509 1.0363 1.0635 1.0808 1.0598 1.0660 1.0955 1.0998 1.0975 1.0990 1.0932 1.1014 1.0992 1.1000 1.0931 1.1014 1.0995 1.0975 1.0658 1.0659
irintensity: 0.3321 1.0186 4.9333 0.7232 0.5342 1.8688 1.4346 4.5631 2.1259 0.5271 0.6178 9.5130 10.0617 2.1678 0.5080 7.1642 31.3044 0.4713 97.1852 11.6167 139.5185 16.0153 1.1500 3.1302 3.3839 0.3498 2.5421 6.4887 4.9003 2.5073 5.0527 2.8679 0.2606 5.6148 3.9682 12.8800 3.6938 0.4895 11.8453 0.3749 2.7474 1.1942 12.0539 3.6113 4.5576 4.1339 14.5579 2.6959 8.4808 3.4663 1.5864 10.0134 8.4366 1.6118 20.4650 22.2220 63.8450 2.4144 27.6236 10.2040 9.5163 12.4634 5.4232 33.6210 9.3032 42.8216 10.1985 2.1931 18.7670 4.9645 3.3071 12.0039 7.2664 15.2461 12.3190 7.6155 9.0456 0.9609 11.5311 10.8995 17.9997 9.0580 6.9621 4.5315 5.8171 3.6261 4.5242 1.9517 6.2746 1.6982 0.3760 2.5099 6.3411 1.6196 4.9746 7.2998 5.0691 6.4220 19.7984 1.6334 0.8582 13.2082 3.9361 5.4792 15.7333 10.8093 19.5814 17.3572 7.0231 4.4576 2.1321 12.9521 16.1091 10.7648 14.0620 12.9717 1.3124 12.5396 9.3085 190.4827 18.9065 37.6327 20.2450 30.6241 37.7887 19.0455 48.0621 28.2544 52.0635 25.6518 98.9178 16.9386 18.8944 30.6121 21.1773 8.1172 44.7470 25.3589 41.5203 73.8325 39.9133 67.9352 9.0353 36.7701 53.5951 26.9712 6.9054 12.5176 3.9179 2.3062
temp: 298.150 k
press: 1.00000 atm
elementType: 8 8 8 6 6 6 6 6 6 6 6 6 6 6 6 6 6 6 6 6 6 6 1 1 1 1 1 1 1 1 1 1 1 1 1 1 1 1 1 1 1 1 1 1 1 1 1 1 1 1 1 1
symmnumber: 1
zpe: 1198931.4 jmol-1
zpe.correction: 0.456649 hartree
zpe.thermalcorrener: 0.477567 hartree
zpe.thermalcorrenthalpy: 0.478511 hartree
zpe.thermalcorrgfe: 0.409797 hartree
zpe.sumelectzpe: -965.953542 hartree
zpe.sumelectthermal: -965.932624 hartree
zpe.sumelectthermalent: -965.931679 hartree
zpe.sumelectthermalfe: -966.000394 hartree
dipole: -1.5102 2.1025 -2.3201
dipole: 3.4762
quadrupole: -145.5865 -125.1210 -146.7481
quadrupole: -0.7994 -5.1148 2.5990
quadrupole: -6.4347 14.0309 -7.5962 -0.7994 -5.1148 2.5990
hfenergy: -966.4101905 hartree
pointgroup: C01 [X(C19H30O3)]
dipole: -0.608099 -0.764094 0.9575356 debye
polarizability: 225.5198702|1.6231484|194.2254533|-2.5433003|-3.3849622|179.0487498 unknown
InChI: InChI=1S/C19H30O3/c1-18-8-7-12(20)9-11(18)3-4-13-14-5-6-16(22)19(14,2)10-15(21)17(13)18/h11-15,17,20-21H,3-10H2,1-2H3
charge 0 multiplicity 1
52 atoms
O  0.478853 2.555856 0.863223
O  -4.296386 -0.668841 -2.532179
O  4.526985 0.508553 -1.754133
C  -0.426225 0.361144 0.111945
C  -1.803076 0.580529 0.85302
C  0.475397 -0.701352 0.831902
C  1.749332 -0.906853 -0.011671
C  2.557142 0.406136 -0.220912
C  -2.55255 -0.804047 0.930914
C  0.316561 1.661683 -0.313107
C  -0.293834 -2.039318 0.98588
C  1.685869 1.403896 -1.004542
C  -1.686234 -1.878661 1.636653
C  -2.718614 1.585293 0.08357
C  2.820749 -1.950688 0.406397
C  -3.062914 -1.297582 -0.452642
C  -1.63306 1.132426 2.297795
C  3.804406 -0.12775 -0.949712
C  4.023969 -1.596705 -0.516451
C  -3.187849 1.090771 -1.303212
C  -3.932229 -0.242684 -1.164539
C  3.108409 1.020517 1.107733
H  -0.674367 -0.103425 -0.869233
H  0.760359 -0.33022 1.836169
H  1.399996 -1.214345 -1.027265
H  -3.452669 -0.628075 1.561256
H  -0.326719 2.190515 -1.050384
H  0.312854 -2.747291 1.583669
H  -0.403078 -2.49765 -0.019872
H  1.493967 0.996479 -2.017778
H  2.215777 2.366411 -1.155907
H  -2.217076 -2.852167 1.621364
H  -1.563101 -1.607846 2.702873
H  -2.209355 2.562633 -0.003056
H  -3.615445 1.767095 0.713218
H  2.477342 -2.989184 0.261106
H  3.088129 -1.839236 1.473614
H  -2.225477 -1.559869 -1.126751
H  -3.6503 -2.228385 -0.301127
H  -0.935399 0.53337 2.907385
H  -1.243963 2.161492 2.273053
H  -2.614106 1.127845 2.812987
H  4.037725 -2.220421 -1.431099
H  5.015693 -1.713907 -0.043272
H  -3.857115 1.834769 -1.773852
H  -2.335492 0.945544 -1.99511
H  -4.858178 -0.078616 -0.565515
H  3.754572 0.310352 1.654825
H  3.719553 1.9109 0.870849
H  2.282617 1.33412 1.765366
H  1.044058 3.321455 0.586146
H  -4.762404 -1.542064 -2.478692
