program: Orca
programVersion: 5.0.4
elementType: P O O O O O N C C C C C C C C H H H H H H H H H H H H H H H H
charge: 0
multiplicity: 1
keywords: wb97x-d3
keywords: def2-TZVPP
keywords: def2/J RIJCOSX
keywords: DEFGRID2
keywords: scfconv7
keywords: smallprint printgap noloewdin
keywords: NOSOSCF
formula: C8H16NO5P
InChI: InChI=1/C8H16NO5P/c1-7(6-8(10)9(2)3)14-15(11,12-4)13-5/h6H,1-5H3
31 atoms
P  -2.054278 -0.430122 0.185079
O  -0.898875 -0.304058 -0.924474
O  -1.564586 0.653825 1.244478
O  -3.305793 0.165748 -0.579136
O  -2.322638 -1.777595 0.716371
O  2.997649 -1.261913 0.549104
N  3.574947 0.824884 -0.09455
C  0.393168 -0.754313 -0.686677
C  1.279749 0.149832 -0.272073
C  2.682367 -0.170627 0.078444
C  0.583181 -2.195204 -0.99705
C  4.923893 0.691668 0.409666
C  3.297832 2.041977 -0.828707
C  -2.24721 0.789819 2.497921
C  -3.298927 1.457951 -1.197938
H  0.9415 1.170382 -0.13896
H  0.010082 -2.461297 -1.885759
H  1.625666 -2.443112 -1.168306
H  0.220131 -2.819138 -0.17695
H  5.249513 1.645185 0.826993
H  4.975143 -0.05533 1.196461
H  5.624506 0.410033 -0.380459
H  3.036549 2.871276 -0.166459
H  4.187186 2.328795 -1.39006
H  2.497977 1.905165 -1.551991
H  -2.209544 -0.135989 3.070985
H  -3.287266 1.085821 2.353518
H  -1.732736 1.570849 3.051779
H  -2.894373 2.224349 -0.536327
H  -4.333869 1.701824 -1.425012
H  -2.727071 1.440393 -2.125546
elementType: P O N C H
totalener: -1086.93251732 hartree
nucrepener: 1245.29582859 hartree
electener: -2332.22834591 hartree
oneelecener: -3965.91612002 hartree
twoeener: 1633.68777411 hartree
cpcmener: -0.03819215 hartree
kineticenergy: 1082.88650952 hartree
xcener: -86.053009425497 hartree
chargesum: -0.0000000
charge: 0.926388 -0.345051 -0.336000 -0.344576 -0.614636 -0.546775 -0.116206 0.248884 -0.298617 0.369910 -0.236183 -0.174238 -0.189063 -0.115289 -0.108408 0.146343 0.110549 0.100324 0.109960 0.111512 0.101603 0.113045 0.118372 0.111285 0.119516 0.123058 0.122744 0.123975 0.118996 0.127006 0.121572
qa: 0.9264 -0.3451 -0.3360 -0.3446 -0.6146 -0.5468 -0.1162 0.2489 -0.2986 0.3699 -0.2362 -0.1742 -0.1891 -0.1153 -0.1084 0.1463 0.1105 0.1003 0.1100 0.1115 0.1016 0.1130 0.1184 0.1113 0.1195 0.1231 0.1227 0.1240 0.1190 0.1270 0.1216
va: 5.6126 2.1018 2.0668 2.1029 2.0113 1.9572 3.1650 3.7291 3.9060 4.1534 3.9624 3.8901 3.9015 3.8434 3.8383 1.0080 1.0044 1.0181 1.0085 0.9902 1.0190 0.9871 0.9849 0.9907 0.9899 0.9966 0.9853 0.9898 0.9909 0.9898 0.9910
dispcorr: -0.012471860 hartree
energy: -1086.944989182582
dipole: 11.81290 -11.54321 0.26968 10.59255 -6.75554 3.83701 -1.05380 0.25111 -0.80270
magnitude: 3.92934 au
magnitude: 9.98759 debye
