program: Orca
programVersion: 5.0.4
elementType: P O O O O O N C C C C C C C C H H H H H H H H H H H H H H H H
charge: 0
multiplicity: 1
keywords: wb97x-d3
keywords: def2-TZVPP
keywords: def2/J RIJCOSX
keywords: DEFGRID2
keywords: scfconv7
keywords: smallprint printgap noloewdin
keywords: NOSOSCF
formula: C8H16NO5P
InChI: InChI=1/C8H16NO5P/c1-7(6-8(10)9(2)3)14-15(11,12-4)13-5/h6H,1-5H3
31 atoms
P  -1.886557 0.485968 -0.201212
O  -1.105894 -0.914227 0.013011
O  -3.374816 -0.03455 -0.358233
O  -1.916026 1.215768 1.201533
O  -1.327271 1.330883 -1.269308
O  3.129953 -1.451085 0.580591
N  3.307992 0.708395 -0.053899
C  0.251118 -1.109188 -0.120674
C  1.123808 -0.204648 0.323188
C  2.596028 -0.385914 0.279352
C  0.524878 -2.402619 -0.799171
C  4.750324 0.697188 0.044319
C  2.73059 1.905811 -0.626718
C  -3.790022 -0.736106 -1.538058
C  -2.382531 0.591665 2.40384
H  0.767773 0.708419 0.786993
H  1.579142 -2.548834 -1.00522
H  0.181221 -3.236681 -0.183519
H  -0.023735 -2.448854 -1.741216
H  5.087224 -0.041087 0.765559
H  5.218578 0.479359 -0.918395
H  5.096811 1.676052 0.374746
H  1.724043 1.730461 -0.997743
H  2.698345 2.725322 0.094933
H  3.335279 2.227616 -1.475852
H  -3.353988 -1.733959 -1.570624
H  -3.518718 -0.190131 -2.441133
H  -4.871794 -0.820806 -1.486875
H  -3.463921 0.46128 2.380111
H  -2.123257 1.259067 3.221586
H  -1.901438 -0.372374 2.570627
elementType: P O N C H
totalener: -1086.93430335 hartree
nucrepener: 1254.38885119 hartree
electener: -2341.32315454 hartree
oneelecener: -3983.93157062 hartree
twoeener: 1642.60841609 hartree
cpcmener: -0.03462490 hartree
kineticenergy: 1082.88872583 hartree
xcener: -86.056023598205 hartree
chargesum: -0.0000000
charge: 0.914692 -0.338149 -0.338433 -0.345845 -0.604033 -0.546617 -0.118086 0.240959 -0.250660 0.344669 -0.243462 -0.176151 -0.170508 -0.109758 -0.111370 0.139526 0.094358 0.110511 0.106048 0.101452 0.115175 0.110155 0.111460 0.113832 0.110139 0.122409 0.117937 0.127073 0.124803 0.127279 0.120594
qa: 0.9147 -0.3381 -0.3384 -0.3458 -0.6040 -0.5466 -0.1181 0.2410 -0.2507 0.3447 -0.2435 -0.1762 -0.1705 -0.1098 -0.1114 0.1395 0.0944 0.1105 0.1060 0.1015 0.1152 0.1102 0.1115 0.1138 0.1101 0.1224 0.1179 0.1271 0.1248 0.1273 0.1206
va: 5.6033 2.0876 2.1101 2.0915 2.0044 1.9529 3.1525 3.7576 3.8399 4.1854 3.9720 3.8924 3.8876 3.8372 3.8332 1.0138 1.0259 0.9982 1.0026 1.0175 0.9871 0.9917 1.0076 0.9874 0.9907 0.9900 0.9938 0.9895 0.9929 0.9896 0.9913
dispcorr: -0.013049382 hartree
energy: -1086.947352729355
dipole: 8.23260 -9.40670 -1.17410 -0.99166 1.12483 0.13317 -0.96332 1.18285 0.21953
magnitude: 1.20185 au
magnitude: 3.05485 debye
