program: Orca
programVersion: 5.0.4
elementType: P O O O O O N C C C C C C C C H H H H H H H H H H H H H H H H
charge: 0
multiplicity: 1
keywords: wb97x-d3
keywords: def2-TZVPP
keywords: def2/J RIJCOSX
keywords: DEFGRID2
keywords: scfconv7
keywords: smallprint printgap noloewdin
keywords: NOSOSCF
formula: C8H16NO5P
InChI: InChI=1/C8H16NO5P/c1-7(6-8(10)9(2)3)14-15(11,12-4)13-5/h6H,1-5H3
31 atoms
P  -1.814646 0.273071 -0.04418
O  -1.033121 -1.134879 0.000613
O  -3.316276 -0.21384 -0.254016
O  -1.822331 0.680018 1.494163
O  -1.304589 1.266964 -0.99936
O  3.280964 -1.484898 0.301908
N  3.263981 0.758749 0.024692
C  0.329907 -1.27573 -0.148561
C  1.176359 -0.375017 0.348109
C  2.65403 -0.445357 0.212391
C  0.649153 -2.510285 -0.913433
C  4.703783 0.841438 0.044825
C  2.581091 1.964914 -0.380858
C  -3.787924 -0.525825 -1.559821
C  -2.338129 1.947007 1.888943
H  0.785626 0.467176 0.904929
H  1.718618 -2.656634 -1.011098
H  0.234052 -3.381405 -0.403099
H  0.195018 -2.468184 -1.905187
H  5.015136 1.72249 0.609818
H  5.125653 -0.041865 0.513472
H  5.116651 0.925305 -0.964759
H  1.544648 1.776305 -0.648954
H  2.606565 2.728494 0.401936
H  3.067228 2.383162 -1.265735
H  -3.345111 -1.454146 -1.924582
H  -3.572608 0.275831 -2.266667
H  -4.864441 -0.657545 -1.484559
H  -1.881794 2.759897 1.32293
H  -2.102298 2.069352 2.943019
H  -3.421056 1.986814 1.763448
totalener: -1086.91346856 hartree
nucrepener: 1254.45611611 hartree
electener: -2341.36958467 hartree
oneelecener: -3983.56791700 hartree
twoeener: 1642.19833234 hartree
kineticenergy: 1082.94291311 hartree
xcener: -86.057139936331 hartree
chargesum: 0.0000000
charge: 0.875681 -0.326378 -0.330471 -0.325393 -0.512290 -0.429224 -0.138510 0.235371 -0.224386 0.304699 -0.225942 -0.170913 -0.183120 -0.127782 -0.132481 0.108622 0.109409 0.093629 0.087396 0.092664 0.113631 0.096460 0.122202 0.099379 0.091348 0.109583 0.119259 0.115381 0.117187 0.118409 0.116581
qa: 0.8757 -0.3264 -0.3305 -0.3254 -0.5123 -0.4292 -0.1385 0.2354 -0.2244 0.3047 -0.2259 -0.1709 -0.1831 -0.1278 -0.1325 0.1086 0.1094 0.0936 0.0874 0.0927 0.1136 0.0965 0.1222 0.0994 0.0913 0.1096 0.1193 0.1154 0.1172 0.1184 0.1166
va: 5.6431 2.1651 2.1240 2.0985 2.0784 2.0728 3.1232 3.7997 3.8537 4.2087 3.9583 3.8986 3.9006 3.8723 3.8651 1.0209 1.0339 1.0044 1.0033 0.9909 1.0250 0.9917 1.0121 0.9874 0.9933 0.9894 0.9943 0.9905 0.9941 0.9898 0.9922
dispcorr: -0.012697698 hartree
energy: -1086.926166254282
dipole: 7.39377 -8.43963 -1.04586 5.37509 -4.40601 0.96907 -3.04384 2.91896 -0.12489
magnitude: 1.43127 au
magnitude: 3.63800 debye
