program: Orca
programVersion: 5.0.4
elementType: P O O O O O N C C C C C C C C H H H H H H H H H H H H H H H H
charge: 0
multiplicity: 1
keywords: wb97x-d3
keywords: def2-TZVPP
keywords: def2/J RIJCOSX
keywords: DEFGRID2
keywords: scfconv7
keywords: smallprint printgap noloewdin
keywords: NOSOSCF
formula: C8H16NO5P
InChI: InChI=1/C8H16NO5P/c1-7(6-8(10)9(2)3)14-15(11,12-4)13-5/h6H,1-5H3
31 atoms
P  -2.198696 0.435803 0.354605
O  -0.878979 -0.438275 -0.01531
O  -3.14942 0.004546 -0.849263
O  -2.881067 -0.299213 1.582801
O  -1.951191 1.862032 0.567037
O  3.244342 -0.689032 1.058984
N  3.667371 0.157622 -0.987454
C  0.381541 -0.230128 0.498615
C  1.386259 -0.331596 -0.375074
C  2.825299 -0.295808 -0.014906
C  0.457171 0.043619 1.959464
C  5.09457 0.06617 -0.792795
C  3.251793 0.869672 -2.170291
C  -2.930998 0.529219 -2.153643
C  -3.233831 -1.676141 1.571456
H  1.122782 -0.513824 -1.409863
H  -0.038259 0.985681 2.199116
H  -0.045084 -0.746461 2.520299
H  1.485892 0.089686 2.295162
H  5.323035 -0.64504 -0.005901
H  5.572052 -0.266918 -1.716535
H  5.526469 1.032679 -0.51786
H  3.872479 1.758859 -2.299798
H  3.350505 0.2620 -3.074891
H  2.224125 1.212223 -2.090801
H  -2.815178 1.613167 -2.134107
H  -3.804488 0.276951 -2.749689
H  -2.048256 0.081447 -2.612861
H  -3.578633 -1.919051 2.573205
H  -2.379763 -2.31079 1.32982
H  -4.036948 -1.872735 0.861551
totalener: -1086.91144905 hartree
nucrepener: 1235.76765499 hartree
electener: -2322.67910404 hartree
oneelecener: -3946.04785941 hartree
twoeener: 1623.36875537 hartree
kineticenergy: 1082.93779562 hartree
xcener: -86.057377871013 hartree
chargesum: 0.0000000
charge: 0.864121 -0.327981 -0.329443 -0.318158 -0.496277 -0.435678 -0.136560 0.214447 -0.266801 0.330700 -0.228948 -0.170930 -0.193043 -0.126386 -0.128726 0.115204 0.114398 0.093162 0.117042 0.114460 0.093754 0.097551 0.096923 0.107480 0.109572 0.120956 0.115232 0.107211 0.121006 0.107208 0.118507
qa: 0.8641 -0.3280 -0.3294 -0.3182 -0.4963 -0.4357 -0.1366 0.2144 -0.2668 0.3307 -0.2289 -0.1709 -0.1930 -0.1264 -0.1287 0.1152 0.1144 0.0932 0.1170 0.1145 0.0938 0.0976 0.0969 0.1075 0.1096 0.1210 0.1152 0.1072 0.1210 0.1072 0.1185
va: 5.6261 2.0696 2.1050 2.1070 2.1282 2.0648 3.1304 3.8354 3.8271 4.1890 3.9107 3.8976 3.9168 3.8739 3.8716 1.0144 1.0155 1.0039 1.0353 1.0252 0.9900 0.9913 0.9920 0.9846 0.9993 0.9935 0.9911 0.9897 0.9889 0.9911 0.9944
dispcorr: -0.012406003 hartree
energy: -1086.923855050563
dipole: 11.62450 -11.93579 -0.31130 -1.85122 1.15907 -0.69215 -7.29850 5.72518 -1.57332
magnitude: 1.74680 au
magnitude: 4.44001 debye
