program: Orca
programVersion: 5.0.4
elementType: P O O O O O N C C C C C C C C H H H H H H H H H H H H H H H H
charge: 0
multiplicity: 1
keywords: wb97x-d3
keywords: def2-TZVPP
keywords: def2/J RIJCOSX
keywords: DEFGRID2
keywords: scfconv7
keywords: smallprint printgap noloewdin
keywords: NOSOSCF
formula: C8H16NO5P
InChI: InChI=1/C8H16NO5P/c1-7(6-8(10)9(2)3)14-15(11,12-4)13-5/h6H,1-5H3
31 atoms
P  -2.141075 0.136874 0.260451
O  -0.730679 -0.47935 -0.21032
O  -3.03657 -0.168185 -1.021974
O  -2.654205 -0.962798 1.289597
O  -2.121827 1.52872 0.728173
O  3.341129 -0.627953 1.070503
N  3.826356 0.233585 -0.956571
C  0.491311 -0.292258 0.393095
C  1.536381 -0.297472 -0.43934
C  2.955967 -0.241518 -0.018967
C  0.491115 -0.140421 1.872925
C  5.247648 0.146501 -0.722267
C  3.434833 0.891319 -2.179135
C  -3.065459 0.764757 -2.096529
C  -3.781052 -0.668995 2.11102
H  1.317308 -0.409426 -1.49381
H  -0.048528 0.76146 2.166511
H  -0.005941 -0.993155 2.338214
H  1.503203 -0.088939 2.255041
H  5.447574 -0.499203 0.126258
H  5.747402 -0.265338 -1.601968
H  5.679767 1.129532 -0.516047
H  4.133114 1.702862 -2.389128
H  3.441896 0.217212 -3.041648
H  2.448227 1.339941 -2.095495
H  -3.267348 1.776817 -1.745053
H  -3.863182 0.45219 -2.765725
H  -2.123338 0.759685 -2.647177
H  -3.626888 0.243064 2.687666
H  -3.901564 -1.508224 2.790989
H  -4.68946 -0.565994 1.515484
totalener: -1086.91249455 hartree
nucrepener: 1227.92447855 hartree
electener: -2314.83697310 hartree
oneelecener: -3930.52773116 hartree
twoeener: 1615.69075806 hartree
kineticenergy: 1082.94925424 hartree
xcener: -86.059878460250 hartree
chargesum: 0.0000000
charge: 0.879420 -0.306569 -0.330527 -0.326693 -0.516413 -0.440776 -0.134757 0.216669 -0.254651 0.338890 -0.261763 -0.172039 -0.200916 -0.126278 -0.128714 0.114558 0.111900 0.103847 0.121712 0.115482 0.095697 0.094357 0.095497 0.111395 0.109651 0.119897 0.115025 0.106405 0.120703 0.117397 0.111593
qa: 0.8794 -0.3066 -0.3305 -0.3267 -0.5164 -0.4408 -0.1348 0.2167 -0.2547 0.3389 -0.2618 -0.1720 -0.2009 -0.1263 -0.1287 0.1146 0.1119 0.1038 0.1217 0.1155 0.0957 0.0944 0.0955 0.1114 0.1097 0.1199 0.1150 0.1064 0.1207 0.1174 0.1116
va: 5.6448 2.1690 2.1200 2.1008 2.0785 2.0623 3.1272 3.8187 3.7891 4.1871 3.8988 3.8941 3.9178 3.8750 3.8694 1.0192 1.0141 1.0070 1.0394 1.0282 0.9888 0.9906 0.9940 0.9826 0.9953 0.9950 0.9903 0.9891 0.9942 0.9904 0.9911
dispcorr: -0.011871966 hartree
energy: -1086.924366511974
dipole: 9.53600 -10.14901 -0.61302 3.53944 -3.33100 0.20844 -4.76933 3.55755 -1.21178
magnitude: 1.37391 au
magnitude: 3.49221 debye
