program: Orca
programVersion: 5.0.4
elementType: P O O O O O N C C C C C C C C H H H H H H H H H H H H H H H H
charge: 0
multiplicity: 1
keywords: wb97x-d3
keywords: def2-TZVPP
keywords: def2/J RIJCOSX
keywords: DEFGRID2
keywords: scfconv7
keywords: smallprint printgap noloewdin
keywords: NOSOSCF
formula: C8H16NO5P
InChI: InChI=1/C8H16NO5P/c1-7(6-8(10)9(2)3)14-15(11,12-4)13-5/h6H,1-5H3
31 atoms
P  -1.819595 0.444344 -0.251652
O  -1.113908 -0.990307 0.034367
O  -3.338984 -0.014521 -0.375134
O  -1.816658 1.20962 1.139793
O  -1.234555 1.204948 -1.357545
O  3.170311 -1.460086 0.55656
N  3.245357 0.728882 -0.005754
C  0.246646 -1.192617 -0.065505
C  1.10927 -0.286039 0.390515
C  2.587457 -0.419902 0.311894
C  0.545203 -2.484565 -0.737924
C  4.68662 0.761257 0.042672
C  2.619225 1.887497 -0.599902
C  -3.80847 -0.617193 -1.576316
C  -2.246887 0.612382 2.357412
H  0.733887 0.618429 0.854469
H  1.609797 -2.686524 -0.767761
H  0.058897 -3.30537 -0.207804
H  0.149162 -2.475718 -1.755305
H  5.062038 -0.047489 0.661596
H  5.126351 0.663561 -0.954237
H  5.017976 1.711597 0.465384
H  1.577909 1.704155 -0.852497
H  2.670266 2.756816 0.061255
H  3.131506 2.147124 -1.529699
H  -3.380356 -1.611591 -1.711898
H  -3.574811 -0.002979 -2.446139
H  -4.887772 -0.707946 -1.483775
H  -3.303395 0.346586 2.318382
H  -2.097836 1.353599 3.13854
H  -1.661042 -0.27574 2.598483
totalener: -1086.91298347 hartree
nucrepener: 1260.40875719 hartree
electener: -2347.32174066 hartree
oneelecener: -3995.39623618 hartree
twoeener: 1648.07449552 hartree
kineticenergy: 1082.94251245 hartree
xcener: -86.057263460489 hartree
chargesum: -0.0000000
charge: 0.875687 -0.343060 -0.328956 -0.326936 -0.502205 -0.427241 -0.140033 0.232547 -0.221124 0.296571 -0.232134 -0.172045 -0.179378 -0.128226 -0.124950 0.109841 0.110231 0.090206 0.091204 0.113130 0.097859 0.093197 0.127311 0.099355 0.091470 0.110479 0.122030 0.115731 0.119453 0.118877 0.111110
qa: 0.8757 -0.3431 -0.3290 -0.3269 -0.5022 -0.4272 -0.1400 0.2325 -0.2211 0.2966 -0.2321 -0.1720 -0.1794 -0.1282 -0.1250 0.1098 0.1102 0.0902 0.0912 0.1131 0.0979 0.0932 0.1273 0.0994 0.0915 0.1105 0.1220 0.1157 0.1195 0.1189 0.1111
va: 5.6193 2.0815 2.1144 2.0987 2.1196 2.0749 3.1250 3.7903 3.8552 4.2180 3.9673 3.9010 3.8961 3.8706 3.8648 1.0195 1.0330 1.0045 1.0029 1.0236 0.9917 0.9913 1.0119 0.9885 0.9923 0.9895 0.9930 0.9905 0.9942 0.9898 0.9893
dispcorr: -0.013173982 hartree
energy: -1086.926157450830
dipole: 7.72756 -8.74695 -1.01939 -0.36460 0.47638 0.11178 -0.80450 1.01164 0.20714
magnitude: 1.04621 au
magnitude: 2.65926 debye
