program: Orca
programVersion: 5.0.4
elementType: S P O O O N N C C C C C C C C C C C C H H H H H H H H H H H H H H H H H H H H H
charge: 0
multiplicity: 1
keywords: wb97x-d3
keywords: def2-TZVPP
keywords: def2/J RIJCOSX
keywords: DEFGRID2
keywords: scfconv7
keywords: smallprint printgap noloewdin
keywords: NOSOSCF
formula: C12H21N2O3PS
InChI: InChI=1/C12H21N2O3PS/c1-6-15-18(19,16-7-2)17-11-8-10(5)13-12(14-11)9(3)4/h8-9H,6-7H2,1-5H3
40 atoms
S  -1.575375 -0.050065 -2.024308
P  -1.49052 0.616772 -0.230613
O  -0.177248 1.516632 0.165082
O  -2.517926 1.762121 0.168476
O  -1.61793 -0.42567 0.961681
N  1.27961 -0.240603 -0.022445
N  3.598932 0.100699 0.172948
C  2.766452 -2.13668 -0.255357
C  2.542977 -0.668185 -0.025839
C  2.034306 -2.629092 -1.499312
C  2.352981 -2.932882 0.982371
C  1.085942 1.039328 0.173639
C  3.39109 1.40689 0.387892
C  2.1165 1.94162 0.390111
C  4.592476 2.258703 0.616185
C  -3.869672 1.809725 -0.332897
C  -1.508063 -1.856858 0.812834
C  -4.794306 0.899173 0.434855
C  -2.871058 -2.49552 0.746753
H  3.839505 -2.27167 -0.403745
H  0.953295 -2.537429 -1.390971
H  2.264128 -3.680232 -1.676979
H  2.33101 -2.070383 -2.388088
H  2.879489 -2.591718 1.874698
H  2.584837 -3.989637 0.844452
H  1.281715 -2.849684 1.169647
H  1.934032 2.994426 0.551684
H  5.259232 2.216963 -0.245908
H  4.323152 3.297544 0.793088
H  5.157529 1.896818 1.475991
H  -4.169023 2.850411 -0.224525
H  -3.87241 1.56976 -1.39784
H  -0.919167 -2.097036 -0.071557
H  -0.955156 -2.196734 1.687284
H  -4.565672 -0.153142 0.270028
H  -4.75869 1.101927 1.504819
H  -5.816406 1.070104 0.096589
H  -3.477381 -2.243759 1.616581
H  -3.408495 -2.200253 -0.154234
H  -2.752809 -3.57929 0.724676
elementType: S P O N C H
totalener: -1544.88609519 hartree
nucrepener: 1904.12493126 hartree
electener: -3449.01102646 hartree
oneelecener: -5906.28548343 hartree
twoeener: 2457.27445697 hartree
cpcmener: -0.02271426 hartree
kineticenergy: 1539.85741844 hartree
xcener: -113.883569317332 hartree
chargesum: -0.0000000
charge: -0.445553 0.761389 -0.313848 -0.349198 -0.347197 -0.396079 -0.387722 0.064640 0.261570 -0.292430 -0.299210 0.386340 0.205031 -0.224742 -0.241741 0.038534 0.080199 -0.257472 -0.275953 0.041721 0.080290 0.096681 0.102674 0.102238 0.097375 0.086639 0.148495 0.104875 0.097855 0.104864 0.110112 0.090342 0.081842 0.115185 0.091257 0.091896 0.101950 0.098249 0.081448 0.107457
qa: -0.4456 0.7614 -0.3138 -0.3492 -0.3472 -0.3961 -0.3877 0.0646 0.2616 -0.2924 -0.2992 0.3863 0.2050 -0.2247 -0.2417 0.0385 0.0802 -0.2575 -0.2760 0.0417 0.0803 0.0967 0.1027 0.1022 0.0974 0.0866 0.1485 0.1049 0.0979 0.1049 0.1101 0.0903 0.0818 0.1152 0.0913 0.0919 0.1019 0.0982 0.0814 0.1075
va: 1.9756 5.4904 2.1950 2.1133 2.0731 2.9790 3.0870 3.7728 4.0721 3.9416 3.9429 4.0013 3.8356 3.9585 3.9537 3.8529 3.8093 3.9099 3.9595 1.0466 1.0016 1.0066 1.0029 1.0050 1.0049 1.0051 1.0025 1.0036 1.0059 1.0041 0.9913 1.0145 0.9998 0.9875 0.9986 1.0061 1.0092 1.0011 1.0071 1.0105
dispcorr: -0.020140875 hartree
energy: -1544.906236070272
dipole: -0.11539 -0.36576 -0.48115 -15.33684 15.31697 -0.01987 5.60042 -4.52006 1.08036
magnitude: 1.18282 au
magnitude: 3.00650 debye
