program: Orca
programVersion: 5.0.4
elementType: S P O O O N N C C C C C C C C C C C C H H H H H H H H H H H H H H H H H H H H H
charge: 0
multiplicity: 1
keywords: wb97x-d3
keywords: def2-TZVPP
keywords: def2/J RIJCOSX
keywords: DEFGRID2
keywords: scfconv7
keywords: smallprint printgap noloewdin
keywords: NOSOSCF
formula: C12H21N2O3PS
InChI: InChI=1/C12H21N2O3PS/c1-6-15-18(19,16-7-2)17-11-8-10(5)13-12(14-11)9(3)4/h8-9H,6-7H2,1-5H3
40 atoms
S  -3.273538 1.071186 -1.317832
P  -1.719299 0.263897 -0.541655
O  -0.386996 1.11112 -0.952731
O  -1.722633 0.1221 1.042847
O  -1.315637 -1.186132 -1.04116
N  1.11528 -0.160809 0.239308
N  3.408305 0.361327 0.226806
C  2.608886 -1.548472 1.515535
C  2.374778 -0.375847 0.60492
C  2.193599 -2.850385 0.831896
C  1.861439 -1.361347 2.833958
C  0.88654 0.857068 -0.550833
C  3.166911 1.3998 -0.580438
C  1.882935 1.700246 -1.007909
C  4.325911 2.227088 -1.026514
C  -2.322407 1.106829 1.911923
C  -2.200838 -2.317036 -0.874675
C  -1.557754 2.407241 1.930299
C  -1.752787 -3.404631 -1.81382
H  3.67978 -1.588215 1.722595
H  1.12593 -2.857682 0.604713
H  2.401358 -3.700108 1.482889
H  2.73665 -3.007894 -0.101139
H  2.153054 -0.436712 3.333673
H  2.080181 -2.187161 3.511737
H  0.782145 -1.335177 2.677628
H  1.677192 2.536958 -1.660849
H  4.478498 2.120534 -2.101598
H  4.145731 3.284899 -0.834096
H  5.241446 1.930835 -0.520124
H  -3.360324 1.264391 1.613808
H  -2.320049 0.640001 2.894542
H  -2.153926 -2.649121 0.163142
H  -3.227592 -2.013736 -1.091744
H  -1.617193 2.935542 0.978284
H  -1.992348 3.057238 2.690147
H  -0.509022 2.254252 2.184008
H  -1.82173 -3.08826 -2.854245
H  -0.729021 -3.717432 -1.606455
H  -2.398176 -4.273097 -1.682943
elementType: S P O N C H
totalener: -1544.88566122 hartree
nucrepener: 1907.92658208 hartree
electener: -3452.81224330 hartree
oneelecener: -5913.88389383 hartree
twoeener: 2461.07165053 hartree
cpcmener: -0.02514455 hartree
kineticenergy: 1539.84095589 hartree
xcener: -113.875359597236 hartree
chargesum: -0.0000000
charge: -0.432376 0.702074 -0.308122 -0.327080 -0.330154 -0.385054 -0.369636 0.085348 0.268085 -0.294093 -0.297934 0.372743 0.196011 -0.234980 -0.244263 0.031444 0.023060 -0.245048 -0.240341 0.041167 0.075875 0.096237 0.101215 0.101881 0.095761 0.079071 0.148788 0.111207 0.108404 0.092820 0.101085 0.112173 0.112858 0.102073 0.083764 0.107679 0.090113 0.089051 0.089287 0.089806
qa: -0.4324 0.7021 -0.3081 -0.3271 -0.3302 -0.3851 -0.3696 0.0853 0.2681 -0.2941 -0.2979 0.3727 0.1960 -0.2350 -0.2443 0.0314 0.0231 -0.2450 -0.2403 0.0412 0.0759 0.0962 0.1012 0.1019 0.0958 0.0791 0.1488 0.1112 0.1084 0.0928 0.1011 0.1122 0.1129 0.1021 0.0838 0.1077 0.0901 0.0891 0.0893 0.0898
va: 2.0290 5.5256 2.1614 2.0595 2.1013 2.9366 3.1003 3.7642 4.0483 3.9505 3.9414 3.9935 3.8656 3.9619 3.9142 3.8310 3.8272 3.8967 3.9608 1.0462 1.0070 1.0049 1.0031 1.0026 1.0053 1.0138 1.0044 0.9963 0.9976 1.0224 1.0134 0.9915 0.9925 1.0073 1.0170 1.0096 1.0065 1.0047 1.0016 1.0068
dispcorr: -0.019446259 hartree
energy: -1544.905107477937
dipole: 11.42649 -10.76333 0.66316 -10.99626 10.77235 -0.22391 11.88318 -10.87545 1.00773
magnitude: 1.22696 au
magnitude: 3.11868 debye
