program: Gaussian 09
title: 000065428
version: EM64L-G09RevD.01
frameworkgroup: C1[X(C13H24O2)]
method: RPBEPBE
basis: SDD
operation: Freq
keyword: #pfreq=noraman
keyword: PBEPBE/SDD
title: #p freq=noraman PBEPBE/SDD
converged: YES YES NO NO
title: Mulliken charges:
elementType: O O C C C C C C C C C C C C C H H H H H H H H H H H H H H H H H H H H H H H H
charge: -0.330385 -0.476423 0.377496 0.261620 0.195125 -0.582196 -0.437807 -0.463701 -0.404661 -0.499028 0.046028 -0.745313 -0.771167 -0.779740 -0.730609 0.260737 0.218277 0.214336 0.192066 0.190863 0.222102 0.209633 0.194437 0.226952 0.221601 0.196122 0.194236 0.204239 0.267705 0.212597 0.240815 0.203591 0.232775 0.200498 0.246033 0.334192 0.209768 0.215284 0.231904
chargesum: 0.00000
title: Mulliken charges with hydrogens summed into heavy atoms:
elementType: O O C C C C C C C C C C C C C
charge: -0.330385 -0.142231 0.377496 0.261620 0.195125 -0.103181 -0.031404 -0.050737 -0.000592 -0.050475 0.242150 -0.079133 -0.114165 -0.100434 -0.073654
polarizability: 1.53932187e+02 2.22631658e-01 1.40896873e+02 3.76812550e-01 -1.43872907e+00 1.28325002e+02
1716.lowfreq: -20.0907 -11.2172 0.0005 0.0006 0.0007 9.6150 82.3129 94.3168 128.5591
frequency: 81.7972 94.2937 128.5381 148.7977 166.3442 197.7349 208.6386 247.3063 250.1362 258.2899 270.3481 279.2057 281.7906 296.1915 313.7222 314.9905 335.5306 342.1967 360.4510 402.7860 418.6971 441.8269 483.7380 501.7074 516.7293 546.0787 563.1886 576.7016 702.3694 755.7318 777.1459 804.6271 840.8402 856.5623 873.9286 876.1560 899.7002 918.0336 930.2909 940.4650 958.5730 974.6557 979.5317 992.5821 1005.3497 1024.9006 1053.4584 1060.9831 1065.2285 1079.2562 1092.6642 1133.2589 1144.3883 1156.5580 1175.1292 1185.1386 1189.9780 1204.1809 1213.2292 1222.3885 1247.0675 1283.0855 1289.5750 1295.3448 1312.1767 1337.4352 1340.4244 1350.2487 1353.3506 1358.2641 1369.8810 1376.5609 1385.4140 1390.3085 1447.1195 1453.4243 1458.3497 1463.1499 1463.4860 1466.4681 1468.2077 1472.6007 1474.6104 1481.5650 1487.6439 1493.9621 1501.3905 2938.6480 2962.0441 2968.6946 2973.1504 2975.3413 2977.7444 2982.9949 2990.9318 3007.9275 3024.3416 3028.2932 3029.5297 3049.4871 3055.4088 3061.0071 3063.1349 3067.5116 3080.5654 3086.0072 3088.2039 3092.0046 3105.2359 3111.8669 3546.2517
redmass: 2.9051 3.2006 2.6397 2.1052 1.3399 2.0286 1.1723 1.4862 1.3940 1.3803 1.5497 2.2860 1.9651 1.9022 2.3749 2.9377 2.9820 2.7581 2.4817 2.7444 2.2121 2.5517 3.0969 2.9493 2.7909 2.7401 2.3675 2.8662 3.9277 3.0089 2.7304 2.0411 2.7573 1.6975 2.3631 2.1569 2.0580 1.7717 1.4918 1.7160 2.8635 1.5483 1.4889 1.4686 1.8858 1.7455 1.4922 2.3301 1.9553 1.7559 2.9632 1.7939 1.7352 2.1064 2.3470 1.9809 1.9574 1.4731 1.9552 1.9569 2.2871 1.4833 1.4558 1.2750 1.2573 1.6047 1.5211 1.4880 1.5660 1.5278 1.1920 1.2167 1.2661 1.2036 1.0819 1.0708 1.0591 1.0781 1.0703 1.0601 1.0735 1.0610 1.0491 1.0568 1.0664 1.0734 1.0664 1.0841 1.0623 1.0571 1.0368 1.0404 1.0395 1.0358 1.0622 1.0593 1.0990 1.0687 1.0952 1.1009 1.0984 1.0977 1.0964 1.0993 1.0991 1.0991 1.1003 1.1020 1.0993 1.0968 1.0658
irintensity: 1.2092 0.4062 0.3318 0.9966 0.7624 4.2077 0.2235 3.4522 2.1121 25.5461 72.4457 7.5689 11.1161 1.0621 6.8797 2.5423 3.8933 1.0605 1.3590 1.2592 1.1287 1.4983 3.3391 4.6250 1.9618 1.4523 2.8100 2.7039 1.7402 6.3438 6.0844 6.9668 12.2840 7.6337 12.0430 13.7038 9.8977 16.8779 3.3058 2.5565 75.0601 13.7700 10.7504 7.3227 6.3525 0.4142 38.6426 41.5546 44.5858 0.9175 0.1649 10.4999 22.5026 11.9649 6.7703 13.6640 1.9789 6.8337 1.0304 3.0291 7.0974 3.4589 17.7247 2.5629 2.2169 7.7626 5.8524 2.6926 6.4010 6.3734 19.3823 17.6305 35.7680 23.6997 6.5824 2.1330 5.8884 11.5052 2.2517 4.2824 6.4636 5.8489 5.9419 8.0297 25.5123 12.8586 29.0339 49.2012 26.9161 22.6153 28.4412 61.8411 58.1143 25.1529 56.6228 41.6546 33.6956 10.2405 17.2204 52.4477 1.3455 65.3654 81.9641 5.2330 37.7498 22.5810 22.7340 45.7651 18.4115 11.2647 2.6433
temp: 298.150 k
press: 1.00000 atm
elementType: 8 8 6 6 6 6 6 6 6 6 6 6 6 6 6 1 1 1 1 1 1 1 1 1 1 1 1 1 1 1 1 1 1 1 1 1 1 1 1
symmnumber: 1
zpe: 910373.0 jmol-1
zpe.correction: 0.346743 hartree
zpe.thermalcorrener: 0.362920 hartree
zpe.thermalcorrenthalpy: 0.363864 hartree
zpe.thermalcorrgfe: 0.306347 hartree
zpe.sumelectzpe: -659.000591 hartree
zpe.sumelectthermal: -658.984414 hartree
zpe.sumelectthermalent: -658.983470 hartree
zpe.sumelectthermalfe: -659.040988 hartree
dipole: -0.9183 1.0445 0.2688
dipole: 1.4165
quadrupole: -90.3331 -88.4830 -97.0752
quadrupole: 3.4406 -2.5539 0.1863
quadrupole: 1.6307 3.4808 -5.1115 3.4406 -2.5539 0.1863
hfenergy: -659.347334 hartree
pointgroup: C01 [X(C13H24O2)]
dipole: 0.3628625 0.4126684 -0.092906 debye
polarizability: 153.879469|-0.2157169|140.8908514|1.2358425|1.4526522|128.383742 unknown
InChI: InChI=1S/C13H24O2/c1-10-6-9-13(15-10)11(2,3)7-5-8-12(13,4)14/h10,14H,5-9H2,1-4H3
charge 0 multiplicity 1
39 atoms
O  1.019801 -0.146892 0.878352
O  -1.417868 1.526087 -1.393006
C  0.068457 -0.077934 -0.285025
C  -0.987115 -1.249037 -0.111264
C  -0.564212 1.366683 -0.175907
C  0.960239 -0.229563 -1.557732
C  -1.850359 -0.987252 1.163048
C  -1.439739 1.49953 1.093726
C  -2.516295 0.402286 1.186909
C  2.422933 -0.070112 -1.068221
C  2.369349 -0.549561 0.398264
C  -1.905719 -1.401829 -1.356761
C  -0.252097 -2.600026 0.11147
C  0.497351 2.486189 -0.196451
C  3.410486 0.051037 1.344068
H  0.677065 0.510556 -2.323354
H  0.823818 -1.22827 -2.006131
H  -1.194135 -1.083308 2.051149
H  -2.618352 -1.783228 1.23511
H  -1.901381 2.509156 1.102245
H  -0.771882 1.43712 1.974734
H  -3.228064 0.503667 0.345425
H  -3.097659 0.526528 2.121138
H  3.132701 -0.664637 -1.670682
H  2.745337 0.98591 -1.10494
H  2.434266 -1.659657 0.428203
H  -2.618652 -2.230859 -1.182804
H  -1.321218 -1.65077 -2.261855
H  -2.465902 -0.480116 -1.572017
H  -1.001749 -3.399991 0.260765
H  0.387515 -2.556609 1.009655
H  0.369963 -2.894217 -0.754087
H  1.047048 2.498899 -1.153411
H  0.00051 3.470045 -0.079359
H  1.214348 2.365112 0.631807
H  -1.773973 2.451391 -1.383304
H  4.428297 -0.263571 1.047788
H  3.364474 1.154764 1.324638
H  3.233113 -0.284422 2.381017
