program: Orca
programVersion: 5.0.4
elementType: S P O O O N N C C C C C C C C C C C C H H H H H H H H H H H H H H H H H H H H H
charge: 0
multiplicity: 1
keywords: wb97x-d3
keywords: def2-TZVPP
keywords: def2/J RIJCOSX
keywords: DEFGRID2
keywords: scfconv7
keywords: smallprint printgap noloewdin
keywords: NOSOSCF
formula: C12H21N2O3PS
InChI: InChI=1/C12H21N2O3PS/c1-6-15-18(19,16-7-2)17-11-8-10(5)13-12(14-11)9(3)4/h8-9H,6-7H2,1-5H3
40 atoms
S  -1.14933 -2.298234 0.922396
P  -1.445845 -0.422007 0.702219
O  -0.253098 0.594586 1.171515
O  -1.747659 0.128056 -0.760558
O  -2.602445 0.108015 1.650202
N  1.230671 -0.0872 -0.434391
N  3.486307 0.559865 -0.328567
C  2.772445 -0.823701 -2.176819
C  2.471434 -0.075671 -0.901887
C  3.266488 0.149856 -3.24915
C  1.598359 -1.645085 -2.687675
C  1.001574 0.58733 0.670056
C  3.24826 1.24359 0.787502
C  1.977229 1.291185 1.346515
C  4.390397 1.958965 1.429828
C  -2.367106 -0.683139 -1.777665
C  -3.024646 1.488997 1.719453
C  -3.843121 -0.876704 -1.533355
C  -4.504561 1.519613 1.998663
H  3.598873 -1.504412 -1.944819
H  2.486523 0.863497 -3.522323
H  3.548313 -0.394249 -4.151641
H  4.137911 0.711493 -2.914496
H  1.242163 -2.361375 -1.947599
H  1.898758 -2.208751 -3.572071
H  0.756306 -1.011923 -2.971837
H  1.768191 1.839664 2.254616
H  4.565403 1.581027 2.438364
H  5.302938 1.835132 0.851034
H  4.178243 3.025175 1.521976
H  -2.1931 -0.143793 -2.707369
H  -1.848185 -1.64154 -1.841257
H  -2.463603 1.972089 2.520713
H  -2.801992 2.011717 0.787447
H  -4.272652 -1.421978 -2.374713
H  -4.037546 -1.460096 -0.632385
H  -4.365283 0.077351 -1.453608
H  -4.749495 1.004096 2.927713
H  -4.82832 2.556092 2.098198
H  -5.074098 1.066352 1.186792
elementType: S P O N C H
totalener: -1544.89615560 hartree
nucrepener: 1886.42434304 hartree
electener: -3431.32049865 hartree
oneelecener: -5870.95969866 hartree
twoeener: 2439.63920001 hartree
cpcmener: -0.02242476 hartree
kineticenergy: 1539.83725521 hartree
xcener: -113.876322935908 hartree
chargesum: -0.0000000
charge: -0.422917 0.722951 -0.306068 -0.329075 -0.339126 -0.355649 -0.392653 0.085033 0.267429 -0.285025 -0.291745 0.365758 0.173241 -0.233327 -0.242547 0.037426 0.021579 -0.252062 -0.237419 0.049772 0.091091 0.092335 0.092394 0.087678 0.101368 0.079504 0.146864 0.108541 0.094180 0.107865 0.111802 0.093963 0.106561 0.106767 0.103762 0.085070 0.090473 0.089804 0.089967 0.084433
qa: -0.4229 0.7230 -0.3061 -0.3291 -0.3391 -0.3556 -0.3927 0.0850 0.2674 -0.2850 -0.2917 0.3658 0.1732 -0.2333 -0.2425 0.0374 0.0216 -0.2521 -0.2374 0.0498 0.0911 0.0923 0.0924 0.0877 0.1014 0.0795 0.1469 0.1085 0.0942 0.1079 0.1118 0.0940 0.1066 0.1068 0.1038 0.0851 0.0905 0.0898 0.0900 0.0844
va: 2.0134 5.5101 2.1761 2.0571 2.1121 2.9949 3.0526 3.7808 4.0643 3.9080 3.9470 4.0159 3.9018 3.9450 3.9134 3.8308 3.8509 3.9339 3.9510 1.0293 1.0022 1.0042 1.0222 1.0161 1.0056 1.0016 1.0040 0.9972 1.0224 0.9972 0.9893 1.0073 0.9950 0.9964 1.0103 1.0155 1.0032 1.0037 1.0070 1.0055
dispcorr: -0.019175022 hartree
energy: -1544.915330624137
dipole: -1.14898 0.51034 -0.63864 7.12252 -4.94053 2.18199 -13.70882 13.36985 -0.33897
magnitude: 2.29866 au
magnitude: 5.84273 debye
