program: Orca
programVersion: 5.0.4
elementType: S P O O O N N C C C C C C C C C C C C H H H H H H H H H H H H H H H H H H H H H
charge: 0
multiplicity: 1
keywords: wb97x-d3
keywords: def2-TZVPP
keywords: def2/J RIJCOSX
keywords: DEFGRID2
keywords: scfconv7
keywords: smallprint printgap noloewdin
keywords: NOSOSCF
formula: C12H21N2O3PS
InChI: InChI=1/C12H21N2O3PS/c1-6-15-18(19,16-7-2)17-11-8-10(5)13-12(14-11)9(3)4/h8-9H,6-7H2,1-5H3
40 atoms
S  -1.115741 -2.346438 0.759523
P  -1.497589 -0.472113 0.733733
O  -0.304434 0.513403 1.284506
O  -1.885119 0.221467 -0.642984
O  -2.631089 -0.072552 1.767593
N  1.140634 -0.001565 -0.415448
N  3.388865 0.685075 -0.322439
C  2.617271 -0.606997 -2.230378
C  2.374761 0.068448 -0.908158
C  1.822142 0.080676 -3.338762
C  2.282427 -2.094427 -2.152234
C  0.929308 0.575814 0.743033
C  3.163373 1.284375 0.850255
C  1.912052 1.254726 1.443517
C  4.311022 1.97036 1.514535
C  -2.144304 -0.49586 -1.865332
C  -3.512374 1.068106 1.671952
C  -3.561977 -1.005017 -1.921196
C  -2.831665 2.383686 1.958216
H  3.681629 -0.498604 -2.449856
H  0.747698 0.006623 -3.163604
H  2.035189 -0.387321 -4.301055
H  2.077187 1.138166 -3.423399
H  2.504048 -2.581358 -3.10308
H  1.226192 -2.255461 -1.933996
H  2.865316 -2.599707 -1.380547
H  1.71528 1.728374 2.3955
H  5.16235 2.047012 0.841626
H  4.033909 2.970704 1.84793
H  4.626488 1.414346 2.399715
H  -1.953687 0.225115 -2.65869
H  -1.427951 -1.311976 -1.97134
H  -3.9950 1.076701 0.693568
H  -4.282916 0.870027 2.415233
H  -4.284582 -0.196915 -1.804006
H  -3.736472 -1.468732 -2.893102
H  -3.751417 -1.758661 -1.155984
H  -2.129414 2.672569 1.176671
H  -3.595914 3.160318 2.012293
H  -2.309088 2.36764 2.914701
elementType: S P O N C H
totalener: -1544.89453912 hartree
nucrepener: 1908.00569357 hartree
electener: -3452.90023268 hartree
oneelecener: -5914.02562989 hartree
twoeener: 2461.12539721 hartree
cpcmener: -0.02223163 hartree
kineticenergy: 1539.83313536 hartree
xcener: -113.876443158033 hartree
chargesum: 0.0000000
charge: -0.427027 0.731562 -0.307520 -0.332858 -0.344833 -0.390665 -0.365703 0.069523 0.272246 -0.289966 -0.283578 0.369983 0.186228 -0.223544 -0.243739 0.048612 0.036229 -0.247190 -0.248260 0.041679 0.079765 0.094603 0.100691 0.093439 0.071455 0.101729 0.146018 0.094464 0.105770 0.110034 0.112535 0.088313 0.092963 0.107505 0.090809 0.100856 0.082327 0.084935 0.099265 0.091347
qa: -0.4270 0.7316 -0.3075 -0.3329 -0.3448 -0.3907 -0.3657 0.0695 0.2722 -0.2900 -0.2836 0.3700 0.1862 -0.2235 -0.2437 0.0486 0.0362 -0.2472 -0.2483 0.0417 0.0798 0.0946 0.1007 0.0934 0.0715 0.1017 0.1460 0.0945 0.1058 0.1100 0.1125 0.0883 0.0930 0.1075 0.0908 0.1009 0.0823 0.0849 0.0993 0.0913
va: 2.0094 5.4904 2.1672 2.0513 2.1241 2.9772 3.0984 3.7827 4.0365 3.9515 3.9439 4.0227 3.8732 3.9423 3.9128 3.8401 3.8800 3.9443 3.9079 1.0472 1.0027 1.0046 1.0041 1.0065 1.0128 1.0032 1.0039 1.0216 0.9983 0.9966 0.9876 1.0024 0.9948 0.9882 1.0037 1.0098 1.0167 1.0123 1.0088 1.0048
dispcorr: -0.020004511 hartree
energy: -1544.914543626325
dipole: 1.08987 -1.88542 -0.79556 7.27934 -5.19004 2.08931 -14.01700 13.57892 -0.43808
magnitude: 2.27816 au
magnitude: 5.79063 debye
