program: Orca
programVersion: 5.0.4
elementType: S P O O O N N C C C C C C C C C C C C H H H H H H H H H H H H H H H H H H H H H
charge: 0
multiplicity: 1
keywords: wb97x-d3
keywords: def2-TZVPP
keywords: def2/J RIJCOSX
keywords: DEFGRID2
keywords: scfconv7
keywords: smallprint printgap noloewdin
keywords: NOSOSCF
formula: C12H21N2O3PS
InChI: InChI=1/C12H21N2O3PS/c1-6-15-18(19,16-7-2)17-11-8-10(5)13-12(14-11)9(3)4/h8-9H,6-7H2,1-5H3
40 atoms
S  -1.321936 -2.093258 0.690472
P  -1.497458 -0.187986 0.809867
O  -0.203089 0.631176 1.393091
O  -1.916189 0.601816 -0.503257
O  -2.482428 0.39075 1.914174
N  1.07336 0.194997 -0.449596
N  3.360772 0.730062 -0.476322
C  2.347454 -0.353477 -2.417653
C  2.269545 0.239655 -1.035279
C  2.226593 -1.876755 -2.319379
C  3.601144 0.047835 -3.178653
C  0.989295 0.668846 0.769603
C  3.26771 1.218466 0.76441
C  2.065979 1.211349 1.451062
C  4.509042 1.753003 1.397154
C  -1.816308 0.067831 -1.838875
C  -3.686539 -0.286786 2.321174
C  -3.164752 -0.400736 -2.322964
C  -4.813329 -0.0964 1.336829
H  1.472439 0.013383 -2.963885
H  1.312386 -2.180528 -1.808798
H  3.072579 -2.303925 -1.777119
H  2.212229 -2.320429 -3.315938
H  3.698654 1.130503 -3.265746
H  3.565007 -0.36115 -4.189472
H  4.504329 -0.330624 -2.699621
H  1.972215 1.601433 2.455116
H  4.868819 1.065453 2.165596
H  5.299473 1.879378 0.660503
H  4.323538 2.709527 1.886056
H  -1.436126 0.883706 -2.45316
H  -1.087037 -0.741038 -1.869563
H  -3.473595 -1.346292 2.478494
H  -3.935513 0.149783 3.28722
H  -3.907191 0.397158 -2.289432
H  -3.076629 -0.730024 -3.359289
H  -3.52886 -1.24477 -1.736479
H  -4.626492 -0.609203 0.392708
H  -5.727349 -0.513523 1.76126
H  -4.991615 0.959363 1.131007
elementType: S P O N C H
totalener: -1544.89551717 hartree
nucrepener: 1892.71231140 hartree
electener: -3437.60782857 hartree
oneelecener: -5883.45795699 hartree
twoeener: 2445.85012842 hartree
cpcmener: -0.01859851 hartree
kineticenergy: 1539.85916565 hartree
xcener: -113.883335823167 hartree
chargesum: -0.0000000
charge: -0.441929 0.748607 -0.310659 -0.336353 -0.340894 -0.388922 -0.382727 0.046377 0.282895 -0.274004 -0.276317 0.391649 0.174512 -0.239257 -0.244191 0.076519 0.033663 -0.268549 -0.249923 0.051264 0.082580 0.096498 0.093686 0.095501 0.094613 0.077421 0.146840 0.109996 0.095734 0.105386 0.107551 0.084828 0.092368 0.108054 0.096591 0.103000 0.080064 0.085143 0.100130 0.092256
qa: -0.4419 0.7486 -0.3107 -0.3364 -0.3409 -0.3889 -0.3827 0.0464 0.2829 -0.2740 -0.2763 0.3916 0.1745 -0.2393 -0.2442 0.0765 0.0337 -0.2685 -0.2499 0.0513 0.0826 0.0965 0.0937 0.0955 0.0946 0.0774 0.1468 0.1100 0.0957 0.1054 0.1076 0.0848 0.0924 0.1081 0.0966 0.1030 0.0801 0.0851 0.1001 0.0923
va: 1.9771 5.4982 2.1965 2.0830 2.1194 2.9956 3.0479 3.8140 4.0345 3.9127 3.9333 3.9941 3.8983 3.9545 3.9163 3.8113 3.8588 3.9543 3.9041 1.0235 1.0169 1.0034 1.0046 1.0099 1.0026 1.0156 1.0043 0.9965 1.0203 0.9986 0.9929 1.0066 1.0134 0.9916 1.0013 1.0109 1.0082 1.0034 1.0095 1.0061
dispcorr: -0.019491961 hartree
energy: -1544.915009125598
dipole: 2.19138 -2.72087 -0.52949 -0.92520 1.76816 0.84296 -15.41679 15.28084 -0.13596
magnitude: 1.00470 au
magnitude: 2.55375 debye
