program: Orca
programVersion: 5.0.4
elementType: S P O O O N N C C C C C C C C C C C C H H H H H H H H H H H H H H H H H H H H H
charge: 0
multiplicity: 1
keywords: wb97x-d3
keywords: def2-TZVPP
keywords: def2/J RIJCOSX
keywords: DEFGRID2
keywords: scfconv7
keywords: smallprint printgap noloewdin
keywords: NOSOSCF
formula: C12H21N2O3PS
InChI: InChI=1/C12H21N2O3PS/c1-6-15-18(19,16-7-2)17-11-8-10(5)13-12(14-11)9(3)4/h8-9H,6-7H2,1-5H3
40 atoms
S  -1.472766 -1.993768 0.223515
P  -1.578921 -0.085675 0.365163
O  -0.342498 0.677052 1.126498
O  -1.688836 0.787497 -0.953502
O  -2.775424 0.488352 1.239588
N  1.180713 0.058569 -0.460764
N  3.470038 0.507812 -0.172557
C  2.72358 -0.674532 -2.164551
C  2.453373 0.009882 -0.852273
C  2.05624 0.075436 -3.315494
C  2.257788 -2.128694 -2.11602
C  0.933654 0.626642 0.691407
C  3.20837 1.101836 0.99896
C  1.919236 1.184998 1.492072
C  4.370846 1.653311 1.752317
C  -2.177549 0.263632 -2.201949
C  -3.37812 -0.22868 2.333884
C  -3.673932 0.069978 -2.192678
C  -2.520697 -0.223782 3.575347
H  3.804941 -0.655476 -2.315999
H  0.970381 0.086145 -3.207737
H  2.290481 -0.407491 -4.265468
H  2.398193 1.109614 -3.379061
H  2.754236 -2.685819 -1.319759
H  2.483857 -2.63012 -3.058347
H  1.181246 -2.196775 -1.952205
H  1.691285 1.654689 2.438581
H  4.057585 2.205279 2.636287
H  5.031448 0.844719 2.070713
H  4.959576 2.316079 1.117282
H  -1.885119 1.00369 -2.945055
H  -1.659618 -0.669298 -2.433124
H  -4.322737 0.282738 2.511805
H  -3.603859 -1.248942 2.01768
H  -3.999996 -0.224905 -3.190777
H  -3.980435 -0.716206 -1.501625
H  -4.195648 0.990142 -1.928485
H  -3.074748 -0.699101 4.38599
H  -1.596087 -0.78594 3.438748
H  -2.271843 0.78969 3.890417
elementType: S P O N C H
totalener: -1544.89676232 hartree
nucrepener: 1905.56067333 hartree
electener: -3450.45743565 hartree
oneelecener: -5909.39326809 hartree
twoeener: 2458.93583244 hartree
cpcmener: -0.01956540 hartree
kineticenergy: 1539.85968797 hartree
xcener: -113.881498081826 hartree
chargesum: -0.0000000
charge: -0.436056 0.771296 -0.312935 -0.340500 -0.345934 -0.387106 -0.377600 0.077600 0.249415 -0.292554 -0.285391 0.379677 0.206033 -0.223085 -0.241256 0.032271 0.032961 -0.239830 -0.239116 0.041115 0.080319 0.094791 0.100192 0.100759 0.092635 0.072059 0.145656 0.096654 0.105722 0.102482 0.109948 0.091658 0.108251 0.092333 0.096919 0.079727 0.092400 0.097798 0.080286 0.090403
qa: -0.4361 0.7713 -0.3129 -0.3405 -0.3459 -0.3871 -0.3776 0.0776 0.2494 -0.2926 -0.2854 0.3797 0.2060 -0.2231 -0.2413 0.0323 0.0330 -0.2398 -0.2391 0.0411 0.0803 0.0948 0.1002 0.1008 0.0926 0.0721 0.1457 0.0967 0.1057 0.1025 0.1099 0.0917 0.1083 0.0923 0.0969 0.0797 0.0924 0.0978 0.0803 0.0904
va: 1.9791 5.4655 2.1908 2.1022 2.1104 2.9771 3.0942 3.7698 4.0830 3.9526 3.9403 4.0164 3.8313 3.9599 3.9509 3.8572 3.8601 3.9272 3.8997 1.0473 1.0011 1.0046 1.0040 1.0033 1.0063 1.0179 1.0036 1.0057 1.0023 1.0063 0.9893 1.0040 0.9918 1.0128 1.0083 1.0171 1.0061 1.0088 1.0169 1.0060
dispcorr: -0.019286345 hartree
energy: -1544.916048664719
dipole: 2.91422 -3.41905 -0.50484 -0.85818 1.72041 0.86224 -6.94447 7.45426 0.50979
magnitude: 1.12170 au
magnitude: 2.85112 debye
