program: Orca
programVersion: 5.0.4
elementType: S P O O O N N C C C C C C C C C C C C H H H H H H H H H H H H H H H H H H H H H
charge: 0
multiplicity: 1
keywords: wb97x-d3
keywords: def2-TZVPP
keywords: def2/J RIJCOSX
keywords: DEFGRID2
keywords: scfconv7
keywords: smallprint printgap noloewdin
keywords: NOSOSCF
formula: C12H21N2O3PS
InChI: InChI=1/C12H21N2O3PS/c1-6-15-18(19,16-7-2)17-11-8-10(5)13-12(14-11)9(3)4/h8-9H,6-7H2,1-5H3
40 atoms
S  -1.705849 -1.072483 1.853212
P  -1.727653 0.252528 0.471048
O  -0.464273 0.250664 -0.556084
O  -2.912817 0.189384 -0.581659
O  -1.717366 1.778547 0.906588
N  1.58928 -0.277077 -1.240435
N  3.496271 -0.154714 0.132883
C  3.738904 -0.859755 -2.178594
C  2.892608 -0.403417 -1.02125
C  3.715131 0.178477 -3.298483
C  3.284212 -2.225179 -2.687326
C  0.849906 0.143847 -0.240214
C  2.74381 0.276935 1.143765
C  1.374994 0.461617 1.000503
C  3.415796 0.558466 2.446978
C  -3.529721 -1.052415 -0.984037
C  -2.415515 2.254184 2.076943
C  -2.648242 -1.868541 -1.895909
C  -3.914459 2.237106 1.908869
H  4.761819 -0.946843 -1.806048
H  4.365494 -0.133889 -4.116855
H  4.063703 1.15347 -2.954274
H  2.709055 0.303369 -3.701624
H  3.315137 -2.980955 -1.900855
H  3.936759 -2.56377 -3.493439
H  2.266061 -2.186055 -3.07655
H  0.781332 0.83025 1.824511
H  4.4842 0.363991 2.384379
H  3.268719 1.598027 2.743853
H  2.996176 -0.061812 3.240422
H  -3.810244 -1.61972 -0.094409
H  -4.444332 -0.751573 -1.491456
H  -2.108397 1.663723 2.94261
H  -2.050818 3.269928 2.218063
H  -3.213706 -2.732821 -2.246313
H  -2.33342 -1.29811 -2.769666
H  -1.761317 -2.245438 -1.385691
H  -4.368866 2.715961 2.776927
H  -4.226732 2.788509 1.022005
H  -4.31298 1.223608 1.851019
elementType: S P O N C H
totalener: -1544.89554290 hartree
nucrepener: 1867.88287947 hartree
electener: -3412.77842237 hartree
oneelecener: -5833.46874390 hartree
twoeener: 2420.69032153 hartree
cpcmener: -0.02091542 hartree
kineticenergy: 1539.84475541 hartree
xcener: -113.876760270278 hartree
chargesum: -0.0000000
charge: -0.427887 0.735796 -0.298974 -0.341532 -0.344010 -0.375731 -0.361339 0.087255 0.291764 -0.295338 -0.294711 0.340075 0.170140 -0.211186 -0.251062 0.032902 0.036218 -0.238502 -0.240968 0.041573 0.091988 0.099326 0.085627 0.099288 0.092269 0.084656 0.125298 0.094360 0.109304 0.109480 0.095167 0.110725 0.093452 0.110512 0.099144 0.092477 0.080022 0.098369 0.093052 0.081001
qa: -0.4279 0.7358 -0.2990 -0.3415 -0.3440 -0.3757 -0.3613 0.0873 0.2918 -0.2953 -0.2947 0.3401 0.1701 -0.2112 -0.2511 0.0329 0.0362 -0.2385 -0.2410 0.0416 0.0920 0.0993 0.0856 0.0993 0.0923 0.0847 0.1253 0.0944 0.1093 0.1095 0.0952 0.1107 0.0935 0.1105 0.0991 0.0925 0.0800 0.0984 0.0931 0.0810
va: 1.9940 5.5098 2.1658 2.1180 2.1077 2.9923 3.1019 3.7801 3.9807 3.9388 3.9384 4.1540 3.9232 3.9028 3.9127 3.8490 3.8536 3.9043 3.9146 1.0472 1.0044 1.0036 1.0127 1.0033 1.0042 1.0136 1.0179 1.0219 0.9967 0.9964 1.0100 0.9916 1.0094 0.9909 1.0088 1.0066 1.0152 1.0085 1.0059 1.0144
dispcorr: -0.018036207 hartree
energy: -1544.913579104594
dipole: 5.59200 -6.65208 -1.06008 -1.53086 2.33280 0.80194 -8.13891 8.84128 0.70237
magnitude: 1.50340 au
magnitude: 3.82134 debye
