program: Orca
programVersion: 5.0.4
elementType: S P O O O N N C C C C C C C C C C C C H H H H H H H H H H H H H H H H H H H H H
charge: 0
multiplicity: 1
keywords: wb97x-d3
keywords: def2-TZVPP
keywords: def2/J RIJCOSX
keywords: DEFGRID2
keywords: scfconv7
keywords: smallprint printgap noloewdin
keywords: NOSOSCF
formula: C12H21N2O3PS
InChI: InChI=1/C12H21N2O3PS/c1-6-15-18(19,16-7-2)17-11-8-10(5)13-12(14-11)9(3)4/h8-9H,6-7H2,1-5H3
40 atoms
S  -1.158371 -2.644028 0.206598
P  -1.466316 -0.811593 0.65052
O  -0.264448 -0.007922 1.424822
O  -1.825008 0.211434 -0.511621
O  -2.606145 -0.644617 1.742275
N  1.199705 -0.068288 -0.340962
N  3.313673 0.951016 -0.15957
C  2.74574 -0.225019 -2.20257
C  2.398869 0.257998 -0.819519
C  1.75114 0.273785 -3.246516
C  2.838952 -1.750358 -2.221428
C  0.926414 0.317473 0.883275
C  3.022156 1.352785 1.080408
C  1.805606 1.046492 1.666235
C  4.052409 2.138293 1.821891
C  -2.040069 -0.172926 -1.884188
C  -3.08504 0.631053 2.226744
C  -2.032213 1.079058 -2.721172
C  -4.321393 0.380806 3.049714
H  3.730153 0.186128 -2.43603
H  0.758519 -0.148351 -3.087273
H  2.078215 -0.021764 -4.24457
H  1.664479 1.361421 -3.239221
H  3.141305 -2.098301 -3.210308
H  1.877514 -2.20909 -1.985798
H  3.573201 -2.11988 -1.503962
H  1.555755 1.357728 2.67125
H  4.386913 1.594957 2.707317
H  4.917764 2.338557 1.194025
H  3.643784 3.088798 2.167275
H  -1.254116 -0.860379 -2.198601
H  -2.995978 -0.693276 -1.964097
H  -2.306215 1.101684 2.829265
H  -3.311308 1.287669 1.384841
H  -2.839163 1.757146 -2.441918
H  -1.084203 1.610368 -2.635005
H  -2.170622 0.808176 -3.768258
H  -5.115878 -0.069505 2.454196
H  -4.113856 -0.265188 3.903024
H  -4.690135 1.332209 3.434044
elementType: S P O N C H
totalener: -1544.89697103 hartree
nucrepener: 1891.04984259 hartree
electener: -3435.94681361 hartree
oneelecener: -5879.92245924 hartree
twoeener: 2443.97564563 hartree
cpcmener: -0.02220516 hartree
kineticenergy: 1539.82789328 hartree
xcener: -113.873172588477 hartree
chargesum: -0.0000000
charge: -0.419399 0.720756 -0.308653 -0.330853 -0.336626 -0.392129 -0.366540 0.083068 0.270169 -0.312981 -0.288157 0.374870 0.184572 -0.224785 -0.242882 0.028224 0.029258 -0.255493 -0.240290 0.042816 0.081777 0.102188 0.105200 0.092803 0.077785 0.100239 0.146677 0.109322 0.093817 0.107163 0.096609 0.124407 0.103715 0.103292 0.098238 0.083435 0.095593 0.087932 0.088771 0.086092
qa: -0.4194 0.7208 -0.3087 -0.3309 -0.3366 -0.3921 -0.3665 0.0831 0.2702 -0.3130 -0.2882 0.3749 0.1846 -0.2248 -0.2429 0.0282 0.0293 -0.2555 -0.2403 0.0428 0.0818 0.1022 0.1052 0.0928 0.0778 0.1002 0.1467 0.1093 0.0938 0.1072 0.0966 0.1244 0.1037 0.1033 0.0982 0.0834 0.0956 0.0879 0.0888 0.0861
va: 2.0149 5.5123 2.1645 2.0563 2.1422 2.9818 3.0963 3.7733 4.0356 3.9546 3.9425 4.0236 3.8743 3.9367 3.9101 3.8109 3.8576 3.9592 3.9614 1.0473 0.9954 1.0081 1.0002 1.0052 1.0150 1.0036 1.0037 0.9969 1.0229 0.9976 0.9981 0.9980 0.9932 0.9938 1.0042 1.0047 1.0051 1.0049 1.0039 1.0062
dispcorr: -0.019307105 hartree
energy: -1544.916278131638
dipole: 2.41841 -2.89248 -0.47407 11.49093 -9.10688 2.38404 -11.37489 11.60740 0.23251
magnitude: 2.44181 au
magnitude: 6.20660 debye
