program: Orca
programVersion: 5.0.4
elementType: S P O O O N N C C C C C C C C C C C C H H H H H H H H H H H H H H H H H H H H H
charge: 0
multiplicity: 1
keywords: wb97x-d3
keywords: def2-TZVPP
keywords: def2/J RIJCOSX
keywords: DEFGRID2
keywords: scfconv7
keywords: smallprint printgap noloewdin
keywords: NOSOSCF
formula: C12H21N2O3PS
InChI: InChI=1/C12H21N2O3PS/c1-6-15-18(19,16-7-2)17-11-8-10(5)13-12(14-11)9(3)4/h8-9H,6-7H2,1-5H3
40 atoms
S  -3.050377 1.562058 -1.268684
P  -1.651489 0.620552 -0.36026
O  -0.214823 1.237492 -0.836865
O  -1.542685 0.779813 1.209981
O  -1.59957 -0.952038 -0.581894
N  1.12434 -0.221913 0.333965
N  3.465643 -0.002781 0.262566
C  2.473157 -1.806891 1.556072
C  2.355404 -0.603709 0.660238
C  1.732734 -3.004505 0.967137
C  1.954788 -1.478361 2.955334
C  1.013359 0.822801 -0.449392
C  3.345972 1.0686 -0.526301
C  2.102986 1.532376 -0.925443
C  4.596253 1.757043 -0.963091
C  -2.169402 -0.07574 2.185685
C  -1.957569 -1.585336 -1.82464
C  -3.676418 -0.002673 2.157704
C  -0.926794 -1.35822 -2.903266
H  3.536373 -2.04647 1.625928
H  2.101695 -3.259412 -0.027666
H  0.662166 -2.809537 0.888738
H  1.86665 -3.881263 1.602053
H  2.497114 -0.643982 3.402904
H  2.072463 -2.339217 3.61512
H  0.895033 -1.218127 2.932837
H  1.989378 2.394083 -1.568918
H  5.476971 1.194479 -0.661133
H  4.615628 1.88545 -2.045773
H  4.658302 2.753882 -0.522595
H  -1.819401 -1.100172 2.050012
H  -1.787357 0.280625 3.140732
H  -2.039161 -2.643169 -1.580244
H  -2.942254 -1.234261 -2.139579
H  -4.030943 1.022803 2.262218
H  -4.095998 -0.424575 1.2444
H  -4.068391 -0.579035 2.99659
H  -1.1891 -1.960377 -3.773748
H  -0.890031 -0.31735 -3.226823
H  0.069061 -1.659936 -2.577551
elementType: S P O N C H
totalener: -1544.89383646 hartree
nucrepener: 1916.58079462 hartree
electener: -3461.47463108 hartree
oneelecener: -5930.90588756 hartree
twoeener: 2469.43125648 hartree
cpcmener: -0.02164034 hartree
kineticenergy: 1539.84412496 hartree
xcener: -113.878590235307 hartree
chargesum: 0.0000000
charge: -0.429985 0.699871 -0.300011 -0.334519 -0.311140 -0.377726 -0.366248 0.079150 0.264354 -0.291535 -0.293482 0.362345 0.189025 -0.234270 -0.243647 0.046226 0.028197 -0.251982 -0.244059 0.042909 0.099918 0.076523 0.094854 0.100361 0.094913 0.081321 0.145987 0.094282 0.106564 0.109456 0.094420 0.107867 0.108694 0.099619 0.092455 0.080813 0.099229 0.105712 0.084912 0.088631
qa: -0.4300 0.6999 -0.3000 -0.3345 -0.3111 -0.3777 -0.3662 0.0791 0.2644 -0.2915 -0.2935 0.3623 0.1890 -0.2343 -0.2436 0.0462 0.0282 -0.2520 -0.2441 0.0429 0.0999 0.0765 0.0949 0.1004 0.0949 0.0813 0.1460 0.0943 0.1066 0.1095 0.0944 0.1079 0.1087 0.0996 0.0925 0.0808 0.0992 0.1057 0.0849 0.0886
va: 2.0353 5.5213 2.1723 2.0985 2.0540 2.9463 3.0990 3.7716 4.0475 3.9400 3.9515 4.0160 3.8720 3.9617 3.9124 3.8539 3.8372 3.9427 3.9035 1.0462 1.0032 1.0139 1.0061 1.0044 1.0045 1.0018 1.0058 1.0226 0.9981 0.9968 0.9936 0.9855 0.9910 1.0155 1.0060 1.0109 1.0100 1.0105 1.0163 1.0058
dispcorr: -0.020265094 hartree
energy: -1544.914101553810
dipole: 8.67858 -7.89666 0.78192 -16.74012 15.44046 -1.29966 7.79684 -7.54723 0.24960
magnitude: 1.53714 au
magnitude: 3.90711 debye
