program: Orca
programVersion: 5.0.4
elementType: S P O O O N N C C C C C C C C C C C C H H H H H H H H H H H H H H H H H H H H H
charge: 0
multiplicity: 1
keywords: wb97x-d3
keywords: def2-TZVPP
keywords: def2/J RIJCOSX
keywords: DEFGRID2
keywords: scfconv7
keywords: smallprint printgap noloewdin
keywords: NOSOSCF
formula: C12H21N2O3PS
InChI: InChI=1/C12H21N2O3PS/c1-6-15-18(19,16-7-2)17-11-8-10(5)13-12(14-11)9(3)4/h8-9H,6-7H2,1-5H3
40 atoms
S  -1.561837 -0.261767 -1.815541
P  -1.501374 0.304315 0.0153
O  -0.261476 1.289154 0.437171
O  -2.695173 1.220618 0.525614
O  -1.419582 -0.7886 1.160981
N  1.332695 -0.295575 0.015787
N  3.618698 0.251633 0.068413
C  2.944705 -2.019608 -0.485848
C  2.620989 -0.600701 -0.105823
C  2.403345 -2.327626 -1.881199
C  2.395795 -3.002959 0.545279
C  1.039066 0.945536 0.317565
C  3.313723 1.5122 0.389125
C  1.996993 1.923324 0.525115
C  4.440036 2.472057 0.587776
C  -3.391445 2.156958 -0.323441
C  -1.910898 -2.133724 0.998089
C  -4.703654 1.577216 -0.785163
C  -3.416014 -2.204732 1.071572
H  4.033446 -2.10339 -0.506082
H  1.315784 -2.244985 -1.911572
H  2.670391 -3.343509 -2.176383
H  2.812172 -1.648892 -2.631448
H  2.783218 -2.801052 1.545121
H  2.680728 -4.022714 0.282337
H  1.306521 -2.96409 0.591806
H  1.735513 2.941957 0.776781
H  4.38943 2.934269 1.574546
H  5.400535 1.971642 0.486602
H  4.392882 3.279397 -0.145015
H  -3.5456 3.04607 0.287138
H  -2.768552 2.443564 -1.172956
H  -1.540762 -2.545129 0.05702
H  -1.454303 -2.694464 1.811928
H  -4.552657 0.715854 -1.435521
H  -5.325872 1.276153 0.058199
H  -5.251075 2.332542 -1.350686
H  -3.893046 -1.706217 0.22673
H  -3.722741 -3.251188 1.050271
H  -3.793089 -1.76461 1.994877
elementType: S P O N C H
totalener: -1544.89575559 hartree
nucrepener: 1895.91660128 hartree
electener: -3440.81235687 hartree
oneelecener: -5890.14518662 hartree
twoeener: 2449.33282975 hartree
cpcmener: -0.01980850 hartree
kineticenergy: 1539.84866911 hartree
xcener: -113.878620908302 hartree
chargesum: 0.0000000
charge: -0.436553 0.765832 -0.314351 -0.343794 -0.336520 -0.386839 -0.365001 0.077531 0.263147 -0.287724 -0.291684 0.371968 0.191816 -0.233979 -0.242781 0.046372 0.034649 -0.245433 -0.236862 0.041747 0.074173 0.092772 0.100487 0.100447 0.094984 0.078710 0.145832 0.107380 0.093543 0.108527 0.105286 0.088222 0.092712 0.110096 0.078081 0.090986 0.098376 0.077185 0.098304 0.092357
qa: -0.4366 0.7658 -0.3144 -0.3438 -0.3365 -0.3868 -0.3650 0.0775 0.2631 -0.2877 -0.2917 0.3720 0.1918 -0.2340 -0.2428 0.0464 0.0346 -0.2454 -0.2369 0.0417 0.0742 0.0928 0.1005 0.1004 0.0950 0.0787 0.1458 0.1074 0.0935 0.1085 0.1053 0.0882 0.0927 0.1101 0.0781 0.0910 0.0984 0.0772 0.0983 0.0924
va: 1.9767 5.4799 2.1978 2.1024 2.0995 2.9746 3.0985 3.7778 4.0502 3.9415 3.9521 4.0197 3.8678 3.9469 3.9097 3.8508 3.8454 3.9144 3.9344 1.0467 1.0174 1.0061 1.0035 1.0035 1.0047 1.0018 1.0051 0.9973 1.0232 0.9969 0.9967 1.0115 1.0063 0.9896 1.0175 1.0024 1.0103 1.0103 1.0094 1.0057
dispcorr: -0.019196546 hartree
energy: -1544.914952139947
dipole: -0.41896 -0.14275 -0.56171 -9.59225 10.27634 0.68410 0.32025 0.46591 0.78616
magnitude: 1.18388 au
magnitude: 3.00917 debye
