program: Orca
programVersion: 5.0.4
elementType: S P O O O N N C C C C C C C C C C C C H H H H H H H H H H H H H H H H H H H H H
charge: 0
multiplicity: 1
keywords: wb97x-d3
keywords: def2-TZVPP
keywords: def2/J RIJCOSX
keywords: DEFGRID2
keywords: scfconv7
keywords: smallprint printgap noloewdin
keywords: NOSOSCF
formula: C12H21N2O3PS
InChI: InChI=1/C12H21N2O3PS/c1-6-15-18(19,16-7-2)17-11-8-10(5)13-12(14-11)9(3)4/h8-9H,6-7H2,1-5H3
40 atoms
S  -1.717408 -0.515254 -1.741587
P  -1.628231 0.145611 0.054192
O  -0.435917 1.21877 0.387005
O  -2.865171 1.010674 0.551873
O  -1.450076 -0.874478 1.255036
N  1.231766 -0.299384 -0.002077
N  3.486919 0.366481 0.012057
C  2.928861 -1.951841 -0.468723
C  2.533425 -0.540879 -0.128219
C  2.354865 -2.353026 -1.826494
C  2.483313 -2.922013 0.622842
C  0.878164 0.934272 0.265363
C  3.120516 1.618557 0.299748
C  1.785928 1.965349 0.43528
C  4.197005 2.640045 0.45996
C  -3.686775 1.805447 -0.322769
C  -1.800448 -2.267533 1.155713
C  -2.999836 3.069086 -0.776253
C  -3.291449 -2.485628 1.221971
H  4.019093 -1.969061 -0.529642
H  1.264038 -2.346591 -1.812679
H  2.680909 -3.359441 -2.092701
H  2.684333 -1.679802 -2.619579
H  2.901261 -2.658033 1.595319
H  2.815235 -3.933885 0.386378
H  1.396593 -2.942111 0.717398
H  1.472862 2.975407 0.660952
H  4.096677 3.168518 1.408611
H  5.181122 2.178645 0.418603
H  4.135701 3.3898 -0.330857
H  -3.999074 1.199351 -1.175329
H  -4.572712 2.034964 0.267091
H  -1.381083 -2.683738 0.237954
H  -1.299292 -2.740598 1.998381
H  -2.65765 3.667205 0.068135
H  -2.150548 2.863784 -1.428583
H  -3.710608 3.670094 -1.344412
H  -3.804578 -2.066483 0.355966
H  -3.492688 -3.557499 1.235922
H  -3.720337 -2.053407 2.125931
elementType: S P O N C H
totalener: -1544.89627515 hartree
nucrepener: 1904.43576407 hartree
electener: -3449.33203921 hartree
oneelecener: -5907.15435284 hartree
twoeener: 2457.82231363 hartree
cpcmener: -0.01956729 hartree
kineticenergy: 1539.86719930 hartree
xcener: -113.882798561149 hartree
chargesum: -0.0000000
charge: -0.436516 0.772041 -0.313316 -0.345676 -0.341819 -0.388790 -0.364753 0.074000 0.263927 -0.285880 -0.291186 0.379650 0.191690 -0.233813 -0.243954 0.031794 0.032668 -0.238990 -0.237911 0.041606 0.073712 0.092762 0.100371 0.100553 0.095118 0.079015 0.146536 0.106497 0.094052 0.109352 0.092930 0.107897 0.091137 0.109250 0.090475 0.080286 0.097606 0.079508 0.096737 0.091433
qa: -0.4365 0.7720 -0.3133 -0.3457 -0.3418 -0.3888 -0.3648 0.0740 0.2639 -0.2859 -0.2912 0.3797 0.1917 -0.2338 -0.2440 0.0318 0.0327 -0.2390 -0.2379 0.0416 0.0737 0.0928 0.1004 0.1006 0.0951 0.0790 0.1465 0.1065 0.0941 0.1094 0.0929 0.1079 0.0911 0.1093 0.0905 0.0803 0.0976 0.0795 0.0967 0.0914
va: 1.9796 5.4656 2.1885 2.1105 2.1017 2.9807 3.0986 3.7828 4.0474 3.9414 3.9523 4.0098 3.8670 3.9480 3.9105 3.8625 3.8571 3.8966 3.9293 1.0469 1.0170 1.0064 1.0034 1.0037 1.0048 1.0019 1.0043 0.9979 1.0228 0.9967 1.0121 0.9919 1.0052 0.9897 1.0063 1.0175 1.0089 1.0167 1.0083 1.0060
dispcorr: -0.019268970 hartree
energy: -1544.915544117191
dipole: 3.91016 -4.37630 -0.46614 -6.38143 7.10898 0.72755 0.63274 0.13918 0.77192
magnitude: 1.15865 au
magnitude: 2.94506 debye
