program: Orca
programVersion: 5.0.4
elementType: S P O O O N N C C C C C C C C C C C C H H H H H H H H H H H H H H H H H H H H H
charge: 0
multiplicity: 1
keywords: wb97x-d3
keywords: def2-TZVPP
keywords: def2/J RIJCOSX
keywords: DEFGRID2
keywords: scfconv7
keywords: smallprint printgap noloewdin
keywords: NOSOSCF
formula: C12H21N2O3PS
InChI: InChI=1/C12H21N2O3PS/c1-6-15-18(19,16-7-2)17-11-8-10(5)13-12(14-11)9(3)4/h8-9H,6-7H2,1-5H3
40 atoms
S  -1.705016 0.106167 -2.006776
P  -1.64268 0.570965 -0.154314
O  -0.326863 1.406766 0.356406
O  -2.734971 1.601425 0.374673
O  -1.741602 -0.585069 0.931309
N  1.123017 -0.315723 -0.070073
N  3.445136 0.006613 0.151121
C  2.637844 -2.152135 -0.5627
C  2.383393 -0.728957 -0.144522
C  1.586913 -2.683123 -1.528134
C  2.747714 -3.029617 0.686375
C  0.928271 0.930995 0.295949
C  3.239872 1.261934 0.542672
C  1.962112 1.792163 0.624853
C  4.440175 2.087741 0.883347
C  -3.576611 2.366374 -0.49542
C  -1.922342 -1.963563 0.588966
C  -4.881263 1.651172 -0.75744
C  -1.400888 -2.808307 1.724829
H  3.613005 -2.154059 -1.05626
H  1.4644 -2.033712 -2.394363
H  0.612515 -2.768457 -1.049797
H  1.874223 -3.672729 -1.885237
H  1.810691 -3.031143 1.245793
H  3.538398 -2.67999 1.349908
H  2.97126 -4.061001 0.410985
H  1.775903 2.813664 0.924762
H  4.386857 2.446263 1.912148
H  5.348435 1.50299 0.764751
H  4.504383 2.966058 0.239822
H  -3.7422 3.312702 0.0193
H  -3.062132 2.578405 -1.4350
H  -2.985644 -2.147656 0.41902
H  -1.395605 -2.188318 -0.339146
H  -5.531519 2.282205 -1.364121
H  -4.712851 0.723267 -1.303052
H  -5.40341 1.423709 0.171455
H  -0.33528 -2.641415 1.87543
H  -1.919433 -2.594271 2.65847
H  -1.549175 -3.862799 1.492012
totalener: -1544.87549965 hartree
nucrepener: 1901.06057584 hartree
electener: -3445.93607549 hartree
oneelecener: -5899.41587578 hartree
twoeener: 2453.47980029 hartree
kineticenergy: 1539.89750351 hartree
xcener: -113.888182264562 hartree
chargesum: -0.0000000
charge: -0.389161 0.728880 -0.296403 -0.318589 -0.310348 -0.354413 -0.328303 0.031119 0.249106 -0.244132 -0.289433 0.371237 0.162780 -0.219103 -0.251866 0.026210 0.018110 -0.226122 -0.244412 0.049860 0.100209 0.066291 0.087790 0.084829 0.102470 0.086356 0.123664 0.096493 0.102817 0.097733 0.092857 0.082842 0.107435 0.096604 0.080020 0.079876 0.086556 0.082923 0.094684 0.082533
qa: -0.3892 0.7289 -0.2964 -0.3186 -0.3103 -0.3544 -0.3283 0.0311 0.2491 -0.2441 -0.2894 0.3712 0.1628 -0.2191 -0.2519 0.0262 0.0181 -0.2261 -0.2444 0.0499 0.1002 0.0663 0.0878 0.0848 0.1025 0.0864 0.1237 0.0965 0.1028 0.0977 0.0929 0.0828 0.1074 0.0966 0.0800 0.0799 0.0866 0.0829 0.0947 0.0825
va: 2.0266 5.4978 2.2131 2.1318 2.1077 3.0017 3.0970 3.8322 4.0730 3.9294 3.9299 4.0473 3.8964 3.9647 3.9000 3.8940 3.8541 3.9024 3.9458 1.0373 1.0123 1.0058 1.0081 1.0022 1.0133 1.0061 1.0130 0.9991 1.0241 0.9990 0.9943 1.0168 0.9978 0.9997 1.0122 1.0268 1.0047 1.0094 1.0082 1.0072
dispcorr: -0.019576336 hartree
energy: -1544.895075985239
dipole: 3.85050 -4.00401 -0.15352 -13.55479 13.82417 0.26939 3.72739 -3.13779 0.58961
magnitude: 0.66616 au
magnitude: 1.69325 debye
