program: Orca
programVersion: 5.0.4
elementType: S P O O O N N C C C C C C C C C C C C H H H H H H H H H H H H H H H H H H H H H
charge: 0
multiplicity: 1
keywords: wb97x-d3
keywords: def2-TZVPP
keywords: def2/J RIJCOSX
keywords: DEFGRID2
keywords: scfconv7
keywords: smallprint printgap noloewdin
keywords: NOSOSCF
formula: C12H21N2O3PS
InChI: InChI=1/C12H21N2O3PS/c1-6-15-18(19,16-7-2)17-11-8-10(5)13-12(14-11)9(3)4/h8-9H,6-7H2,1-5H3
40 atoms
S  -1.338932 -1.947042 0.672664
P  -1.527875 -0.046463 0.771442
O  -0.238303 0.797655 1.337175
O  -1.962998 0.716911 -0.555515
O  -2.528641 0.540696 1.859859
N  1.048051 0.302103 -0.479036
N  3.366198 0.691305 -0.457062
C  2.32899 -0.332533 -2.412738
C  2.259633 0.273331 -1.036456
C  2.14035 -1.848056 -2.2919
C  3.609302 0.013935 -3.156287
C  0.962201 0.770413 0.739732
C  3.273174 1.18018 0.783673
C  2.062301 1.243847 1.445682
C  4.545998 1.634554 1.420958
C  -1.830097 0.156342 -1.869737
C  -3.665967 -0.18994 2.325665
C  -3.113755 -0.509365 -2.306751
C  -4.791509 -0.218661 1.317038
H  1.473791 0.065066 -2.969404
H  1.217748 -2.097862 -1.767363
H  2.970881 -2.297625 -1.745167
H  2.105672 -2.307712 -3.280284
H  3.746331 1.091124 -3.246777
H  3.581056 -0.407036 -4.16195
H  4.48486 -0.384993 -2.646183
H  1.969047 1.629113 2.450545
H  5.210567 0.783276 1.573431
H  5.067681 2.332619 0.767207
H  4.375546 2.113716 2.383053
H  -1.580059 0.99721 -2.516564
H  -0.996627 -0.544877 -1.898712
H  -3.364528 -1.204402 2.596921
H  -3.973313 0.325461 3.234874
H  -3.960975 0.173562 -2.247279
H  -3.019742 -0.838284 -3.34229
H  -3.324244 -1.388148 -1.698229
H  -4.528391 -0.80888 0.439686
H  -5.671675 -0.677047 1.768824
H  -5.061633 0.78546 0.992375
totalener: -1544.87763253 hartree
nucrepener: 1898.99089821 hartree
electener: -3443.86853075 hartree
oneelecener: -5895.22309358 hartree
twoeener: 2451.35456283 hartree
kineticenergy: 1539.90085391 hartree
xcener: -113.890711867028 hartree
chargesum: -0.0000000
charge: -0.391089 0.711655 -0.294563 -0.311162 -0.310123 -0.371452 -0.345615 0.012619 0.264782 -0.260634 -0.242207 0.374985 0.159098 -0.204451 -0.229882 0.071578 0.019093 -0.262734 -0.238629 0.042681 0.094640 0.091378 0.081187 0.088255 0.081590 0.082524 0.122158 0.099604 0.099583 0.082256 0.094241 0.076363 0.091361 0.094784 0.093592 0.089503 0.082417 0.081767 0.087159 0.091686
qa: -0.3911 0.7117 -0.2946 -0.3112 -0.3101 -0.3715 -0.3456 0.0126 0.2648 -0.2606 -0.2422 0.3750 0.1591 -0.2045 -0.2299 0.0716 0.0191 -0.2627 -0.2386 0.0427 0.0946 0.0914 0.0812 0.0883 0.0816 0.0825 0.1222 0.0996 0.0996 0.0823 0.0942 0.0764 0.0914 0.0948 0.0936 0.0895 0.0824 0.0818 0.0872 0.0917
va: 2.0220 5.5162 2.2161 2.1055 2.1392 3.0074 3.0579 3.8626 4.0476 3.9141 3.9355 4.0509 3.9098 3.9743 3.9523 3.8491 3.8959 3.9369 3.8936 1.0221 1.0155 1.0065 1.0060 1.0129 1.0035 1.0189 1.0109 1.0044 1.0083 1.0083 0.9934 1.0100 1.0145 0.9922 1.0005 1.0159 1.0158 1.0117 1.0126 1.0067
dispcorr: -0.019632812 hartree
energy: -1544.897265345425
dipole: 2.64914 -2.94374 -0.29460 -2.75604 3.29737 0.54133 -14.95633 14.91383 -0.04250
magnitude: 0.61777 au
magnitude: 1.57024 debye
