program: Gaussian 09
title: 000065434
version: EM64L-G09RevD.01
frameworkgroup: C1[X(C18H26O5)]
method: RPBEPBE
basis: SDD
operation: Freq
keyword: #pfreq=noraman
keyword: PBEPBE/SDD
title: #p freq=noraman PBEPBE/SDD
converged: YES YES NO NO
title: Mulliken charges:
elementType: O O O O O C C C C C C C C C C C C C C C C C C H H H H H H H H H H H H H H H H H H H H H H H H H H
charge: -0.460541 -0.259722 -0.249052 -0.420904 -0.429170 -0.034928 -0.457634 -0.414059 -0.417652 -0.403561 -0.379070 -0.420604 -0.397869 0.030062 -0.597786 0.504833 -0.737303 0.015745 0.122868 -0.630368 0.236798 0.346471 -0.607673 0.192819 0.207890 0.224436 0.213741 0.203943 0.211885 0.179867 0.207506 0.212095 0.197152 0.206514 0.207499 0.244725 0.230156 0.214439 0.237687 0.212299 0.255877 0.236837 0.235932 0.205759 0.327634 0.266041 0.215268 0.357049 0.356072
chargesum: 0.00000
title: Mulliken charges with hydrogens summed into heavy atoms:
elementType: O O O O O C C C C C C C C C C C C C C C C C C
charge: -0.132907 -0.259722 -0.249052 -0.063855 -0.073097 0.157891 -0.025308 0.003625 -0.025900 0.016039 0.024596 0.031620 0.046726 0.267748 -0.129611 0.504833 -0.058775 0.015745 0.122868 -0.364327 0.236798 0.346471 -0.392405
polarizability: 2.59703454e+02 -1.01552165e+01 2.31213524e+02 -2.08195595e+01 -6.63083967e+00 1.51165035e+02
1716.lowfreq: -8.2982 -5.9614 -0.0003 0.0003 0.0004 5.5114 24.9158 40.2691 45.9818
frequency: 24.8170 40.1799 45.9285 51.7640 71.7443 93.4226 110.2386 122.6842 140.7073 158.5649 180.2056 190.8095 202.6250 209.2873 218.5726 226.6629 234.2608 238.7086 260.6226 274.7810 280.1463 304.6557 309.1239 310.4183 320.9343 344.8189 348.1105 365.0236 395.1657 411.1492 422.6294 452.3439 487.9833 508.0224 522.8110 543.5784 578.5168 587.4002 610.8828 621.1040 636.9844 699.0521 708.8973 736.0995 748.8936 764.6748 776.7483 790.2008 798.2687 820.3252 845.6052 865.9855 873.2245 897.9213 907.0008 924.1081 955.7118 971.4777 976.9273 985.5598 1010.5535 1013.2562 1033.4715 1043.0280 1060.5065 1072.6938 1083.4415 1098.6715 1106.5508 1112.6148 1127.7071 1133.0571 1155.5870 1166.9858 1172.0900 1178.8140 1189.7076 1204.7969 1231.7579 1232.5136 1245.0363 1260.2038 1263.7412 1279.0656 1284.4944 1290.9512 1298.7390 1310.5221 1314.0499 1325.4093 1333.8999 1336.2803 1337.1396 1339.8893 1355.0029 1357.5668 1371.2967 1390.9097 1393.0417 1398.6515 1446.4031 1454.8546 1459.5560 1463.0601 1465.3981 1467.7822 1470.2131 1475.9308 1482.4741 1487.7326 1489.2677 1497.7248 1590.6042 1599.1732 1630.5921 2943.9975 2954.7889 2967.5856 2974.8536 2976.5697 2980.9401 2986.1266 2989.2677 2993.8619 3000.1995 3001.5959 3015.9944 3019.5464 3028.7512 3037.2933 3044.9832 3048.2110 3058.1181 3066.9864 3090.6595 3103.4129 3104.6300 3165.1232 3553.1246 3579.8051 3581.7737
redmass: 4.5325 5.6411 5.3996 5.5949 4.2838 6.0217 2.4595 3.0967 3.4316 3.0872 3.0840 3.0296 3.3207 1.9772 2.8626 2.7910 2.2560 3.9072 3.0626 1.1736 3.3964 1.9980 2.8387 1.8129 2.0515 1.9399 1.3863 4.2043 3.6317 2.6608 2.9129 3.6505 2.8089 3.5015 4.2121 4.5887 3.7739 6.1810 3.3987 3.0349 4.5781 2.6442 1.8534 1.6690 2.2101 1.3218 2.0882 3.6439 4.0838 2.1090 1.7643 1.8375 2.3555 2.2321 1.7698 2.1695 1.8943 2.8198 4.0216 3.0160 1.9050 1.7304 3.3441 6.8606 1.7544 2.2092 2.0114 1.9688 2.2834 1.6004 1.7607 1.3978 1.8249 1.2709 1.4247 1.2808 1.4818 1.3144 3.0410 1.4253 1.4029 1.2708 1.3798 1.3204 1.2479 1.3029 1.1542 1.2360 1.3070 1.4616 1.3883 1.4643 2.5626 1.6012 1.3840 1.4428 1.4304 1.2949 5.3579 1.6054 3.7552 1.0693 1.0784 1.0636 1.0796 1.0869 1.0778 1.1100 1.0615 1.0881 1.1751 2.6197 7.6193 8.8293 6.8816 1.0637 1.0812 1.0615 1.0607 1.0640 1.0613 1.0624 1.0652 1.0366 1.0715 1.0850 1.0938 1.0869 1.0957 1.1008 1.1010 1.0988 1.0985 1.1032 1.0984 1.1003 1.0916 1.0922 1.0658 1.0661 1.0661
irintensity: 0.3364 2.7764 0.0569 0.6082 1.4938 1.5205 0.2778 0.3410 2.5584 0.6094 1.4418 0.2670 0.0150 0.7028 0.2113 6.4434 1.5953 1.8950 0.6478 116.1455 4.5542 11.2693 14.5509 70.4031 55.3240 60.1933 68.4111 0.2623 11.0025 4.2009 2.8760 8.4989 9.3738 4.8574 2.9170 15.0804 7.4728 17.7358 0.6726 11.7009 7.8393 10.4586 15.0619 7.7885 24.0875 1.3135 23.8599 5.9747 13.2471 6.0517 2.1145 27.6479 2.6151 21.9112 7.5280 18.2118 13.6425 43.2574 76.7933 19.0509 54.0473 11.5601 31.3238 135.3647 6.2916 14.3574 11.4941 108.5035 25.9110 12.2621 275.2070 114.5847 6.9538 34.2008 102.3773 2.3386 6.8743 24.0911 137.6045 42.8656 57.3360 9.0767 26.9209 4.2598 46.4119 7.7560 12.0436 1.0010 0.7125 3.7941 5.6218 16.9759 17.9119 2.3520 2.1479 1.4605 1.8040 26.7464 5.0695 4.2708 33.3039 3.7420 9.7293 10.0370 16.5965 2.9357 7.4756 1.4467 26.3486 1.6085 35.9583 1.4332 183.3060 142.8793 227.2544 54.4827 36.1112 17.5319 40.5824 6.9365 40.3499 11.0695 34.5600 20.9966 46.6326 4.1723 33.6713 19.1466 24.0412 53.3875 47.8661 64.1853 62.4948 29.4938 28.9974 29.5573 15.1938 2.6723 2.2345 30.8298 46.2616
temp: 298.150 k
press: 1.00000 atm
elementType: 8 8 8 8 8 6 6 6 6 6 6 6 6 6 6 6 6 6 6 6 6 6 6 1 1 1 1 1 1 1 1 1 1 1 1 1 1 1 1 1 1 1 1 1 1 1 1 1 1
symmnumber: 1
zpe: 1077642.4 jmol-1
zpe.correction: 0.410452 hartree
zpe.thermalcorrener: 0.434227 hartree
zpe.thermalcorrenthalpy: 0.435171 hartree
zpe.thermalcorrgfe: 0.358041 hartree
zpe.sumelectzpe: -1075.853770 hartree
zpe.sumelectthermal: -1075.829995 hartree
zpe.sumelectthermalent: -1075.829051 hartree
zpe.sumelectthermalfe: -1075.906181 hartree
dipole: 3.8067 0.8314 -2.8433
dipole: 4.8236
quadrupole: -126.9752 -125.5432 -144.4911
quadrupole: 12.0283 -9.7870 -5.3395
quadrupole: 5.3613 6.7933 -12.1546 12.0283 -9.7870 -5.3395
hfenergy: -1076.2642218 hartree
pointgroup: C01 [X(C18H26O5)]
dipole: 1.4889439 0.2668184 -1.1459856 debye
polarizability: 258.7574017|-11.38575|231.1912003|-22.0146063|-8.3561784|152.1334118 unknown
InChI: InChI=1S/C18H26O5/c1-12-6-5-9-14(19)8-4-2-3-7-13-10-15(20)11-16(21)17(13)18(22)23-12/h10-12,14,19-21H,2-9H2,1H3
charge 0 multiplicity 1
49 atoms
O  -5.249534 -1.005824 0.369515
O  0.176898 1.853453 -0.129509
O  0.287599 1.014187 2.042493
O  2.981267 2.313943 -0.300029
O  5.214279 -2.01365 -0.976619
C  -3.9062 -0.590196 -0.104122
C  -3.313023 -1.645962 -1.063406
C  -4.111828 0.784659 -0.767282
C  -2.81031 -2.943058 -0.374679
C  -2.807498 1.603162 -0.948272
C  -1.66288 -2.73945 0.64988
C  -2.257024 2.163343 0.384635
C  -0.408076 -2.065498 0.052164
C  -0.878591 2.85168 0.29769
C  0.746023 -1.926801 1.084894
C  1.930666 -1.164568 0.507978
C  -0.77196 3.990076 -0.719394
C  1.892986 0.256645 0.352764
C  0.733168 1.056902 0.866386
C  3.052235 -1.887141 0.048651
C  3.007264 0.912153 -0.234937
C  4.140928 -1.217455 -0.548921
C  4.133551 0.187416 -0.690179
H  -3.240386 -0.472658 0.777237
H  -2.479455 -1.191219 -1.631424
H  -4.097407 -1.900916 -1.803656
H  -4.824691 1.354723 -0.139844
H  -4.603207 0.630481 -1.748123
H  -2.469085 -3.645985 -1.16133
H  -3.658229 -3.454519 0.131443
H  -2.028114 0.986847 -1.438858
H  -3.015911 2.441951 -1.640203
H  -1.381097 -3.728004 1.066974
H  -2.017705 -2.136657 1.510436
H  -2.972913 2.909267 0.788272
H  -2.184017 1.363425 1.143814
H  -0.665607 -1.057576 -0.325056
H  -0.051121 -2.64471 -0.823594
H  -0.592659 3.194108 1.310724
H  1.073859 -2.935722 1.3977
H  0.361657 -1.409759 1.982585
H  0.232878 4.443038 -0.680887
H  -0.944854 3.625257 -1.745923
H  -1.52203 4.77017 -0.493247
H  -5.185549 -1.923103 0.739605
H  3.092505 -2.975662 0.145581
H  4.989722 0.713609 -1.135202
H  3.817446 2.661867 -0.69817
H  5.932233 -1.464665 -1.378859
