program: Orca
programVersion: 5.0.4
elementType: S S P O O O C C C C C C H H H H H H H H H H H H H H H
charge: 0
multiplicity: 1
keywords: wb97x-d3
keywords: def2-TZVPP
keywords: def2/J RIJCOSX
keywords: DEFGRID2
keywords: scfconv7
keywords: smallprint printgap noloewdin
keywords: NOSOSCF
formula: C6H15O3PS2
InChI: InChI=1/C6H15O3PS2/c1-4-11-5-6-12-10(7,8-2)9-3/h4-6H2,1-3H3
27 atoms
S  0.713978 1.493693 0.076619
S  -2.389332 0.201766 0.908029
P  1.274187 -0.45646 -0.389592
O  1.747546 -1.063783 1.007033
O  2.663156 -0.36776 -1.164165
O  0.297379 -1.241697 -1.178082
C  -0.837026 1.740674 -0.858047
C  -2.05712 1.750923 0.043088
C  -3.08086 -0.803569 -0.439047
C  -3.109172 -2.261187 -0.022138
C  0.821992 -1.321966 2.06899
C  3.791592 0.355858 -0.666207
H  -0.914218 0.997465 -1.64861
H  -0.736126 2.713523 -1.339958
H  -2.928113 2.024779 -0.557501
H  -1.954894 2.519172 0.810785
H  -4.085172 -0.448124 -0.672367
H  -2.469794 -0.681039 -1.332787
H  -3.693472 -2.411623 0.886131
H  -3.561917 -2.865788 -0.808223
H  -2.102789 -2.640328 0.155052
H  0.031413 -1.999307 1.747788
H  0.376122 -0.397385 2.432521
H  1.390733 -1.788894 2.868631
H  4.20306 -0.117609 0.224358
H  3.534743 1.392568 -0.442248
H  4.541433 0.347456 -1.452804
elementType: S P O C H
totalener: -1601.27920549 hartree
nucrepener: 1186.24610700 hartree
electener: -2787.52531250 hartree
oneelecener: -4566.37492028 hartree
twoeener: 1778.84960778 hartree
cpcmener: -0.02842531 hartree
kineticenergy: 1597.02394185 hartree
xcener: -99.378914560771 hartree
chargesum: -0.0000000
charge: -0.207766 -0.167232 0.854298 -0.344478 -0.358727 -0.636475 -0.079580 -0.121728 -0.122559 -0.258498 -0.106631 -0.107591 0.112138 0.132918 0.113781 0.115384 0.105494 0.094744 0.091737 0.097884 0.078462 0.114332 0.107263 0.134139 0.123172 0.108281 0.127237
qa: -0.2078 -0.1672 0.8543 -0.3445 -0.3587 -0.6365 -0.0796 -0.1217 -0.1226 -0.2585 -0.1066 -0.1076 0.1121 0.1329 0.1138 0.1154 0.1055 0.0947 0.0917 0.0979 0.0785 0.1143 0.1073 0.1341 0.1232 0.1083 0.1272
va: 2.2535 2.1852 5.4871 2.0781 2.1054 1.9591 3.8431 3.9812 3.9745 3.9334 3.8565 3.8463 1.0283 1.0092 1.0102 1.0084 1.0055 1.0054 1.0019 1.0035 1.0136 0.9858 0.9982 0.9926 0.9917 0.9956 0.9892
dispcorr: -0.011820072 hartree
energy: -1601.291025566051
dipole: -8.81175 8.87563 0.06389 -2.11895 3.65598 1.53703 1.08606 -0.52855 0.55751
magnitude: 1.63626 au
magnitude: 4.15905 debye
