program: Orca
programVersion: 5.0.4
elementType: S S P O O O C C C C C C H H H H H H H H H H H H H H H
charge: 0
multiplicity: 1
keywords: wb97x-d3
keywords: def2-TZVPP
keywords: def2/J RIJCOSX
keywords: DEFGRID2
keywords: scfconv7
keywords: smallprint printgap noloewdin
keywords: NOSOSCF
formula: C6H15O3PS2
InChI: InChI=1/C6H15O3PS2/c1-4-11-5-6-12-10(7,8-2)9-3/h4-6H2,1-3H3
27 atoms
S  0.855655 1.616803 -0.307862
S  -3.465051 0.721028 0.261739
P  1.523362 -0.325534 -0.063193
O  1.500732 -0.53648 1.516544
O  3.090909 -0.220664 -0.347183
O  0.787633 -1.337097 -0.86251
C  -0.921399 1.319776 -0.65069
C  -1.692524 0.908211 0.586347
C  -3.507607 -0.739291 -0.82166
C  -2.940545 -2.001064 -0.203595
C  1.80589 -1.826271 2.075494
C  3.583657 -0.141496 -1.691419
H  -1.000148 0.591014 -1.455112
H  -1.284645 2.273915 -1.031788
H  -1.615936 1.679903 1.353401
H  -1.301058 -0.011505 1.021439
H  -4.56689 -0.870515 -1.049122
H  -3.013694 -0.511758 -1.767096
H  -3.104187 -2.846007 -0.874605
H  -1.86617 -1.927896 -0.036686
H  -3.419782 -2.2291 0.748121
H  2.860286 -2.06759 1.944731
H  1.193327 -2.6081 1.627993
H  1.582213 -1.764895 3.136763
H  3.324701 0.815703 -2.144466
H  3.193564 -0.951229 -2.306917
H  4.665217 -0.226982 -1.63469
elementType: S P O C H
totalener: -1601.28228157 hartree
nucrepener: 1151.50806707 hartree
electener: -2752.79034865 hartree
oneelecener: -4496.36854386 hartree
twoeener: 1743.57819521 hartree
cpcmener: -0.02579985 hartree
kineticenergy: 1597.00888253 hartree
xcener: -99.370949121148 hartree
chargesum: -0.0000000
charge: -0.182614 -0.181214 0.864301 -0.356475 -0.365993 -0.642409 -0.083819 -0.142488 -0.114148 -0.244054 -0.114796 -0.108477 0.122236 0.127225 0.127674 0.102237 0.112360 0.096682 0.098588 0.069747 0.081435 0.127664 0.116778 0.129590 0.110667 0.119319 0.129981
qa: -0.1826 -0.1812 0.8643 -0.3565 -0.3660 -0.6424 -0.0838 -0.1425 -0.1141 -0.2441 -0.1148 -0.1085 0.1222 0.1272 0.1277 0.1022 0.1124 0.0967 0.0986 0.0697 0.0814 0.1277 0.1168 0.1296 0.1107 0.1193 0.1300
va: 2.2890 2.1803 5.4623 2.0655 2.0962 1.9378 3.8384 3.9695 3.9561 3.9006 3.8370 3.8472 1.0295 1.0158 1.0098 1.0234 0.9983 1.0060 1.0048 1.0158 1.0160 0.9920 0.9944 0.9883 0.9939 0.9952 0.9899
dispcorr: -0.011309898 hartree
energy: -1601.293591469203
dipole: -5.35250 6.30088 0.94838 -9.27998 8.98139 -0.29859 -1.71063 1.56273 -0.14790
magnitude: 1.00521 au
magnitude: 2.55504 debye
