program: Orca
programVersion: 5.0.4
elementType: S S P O O O C C C C C C H H H H H H H H H H H H H H H
charge: 0
multiplicity: 1
keywords: wb97x-d3
keywords: def2-TZVPP
keywords: def2/J RIJCOSX
keywords: DEFGRID2
keywords: scfconv7
keywords: smallprint printgap noloewdin
keywords: NOSOSCF
formula: C6H15O3PS2
InChI: InChI=1/C6H15O3PS2/c1-4-11-5-6-12-10(7,8-2)9-3/h4-6H2,1-3H3
27 atoms
S  0.01818 1.081553 0.45159
S  -2.328605 -0.718698 -1.286783
P  1.696801 -0.099834 0.718645
O  2.737665 0.952541 1.30745
O  2.310713 -0.341597 -0.740434
O  1.464134 -1.330145 1.515218
C  -1.274832 0.042924 1.214239
C  -1.744579 -1.126702 0.372854
C  -3.745159 0.353936 -0.907172
C  -4.514724 0.643074 -2.182382
C  4.094222 0.553699 1.568676
C  1.649985 -1.228895 -1.648327
H  -2.090362 0.739441 1.408688
H  -0.927135 -0.309872 2.184431
H  -2.541309 -1.634209 0.922589
H  -0.943045 -1.854296 0.239475
H  -4.383309 -0.147691 -0.177508
H  -3.396205 1.286001 -0.461106
H  -4.923281 -0.267625 -2.619779
H  -5.346399 1.314961 -1.970016
H  -3.884646 1.125473 -2.930314
H  4.13544 -0.388442 2.115097
H  4.536951 1.334923 2.179917
H  4.657453 0.461643 0.640909
H  1.553496 -2.230979 -1.230814
H  2.261336 -1.277169 -2.545678
H  0.661494 -0.848609 -1.913711
elementType: S P O C H
totalener: -1601.27971151 hartree
nucrepener: 1151.54513015 hartree
electener: -2752.82484166 hartree
oneelecener: -4496.59987377 hartree
twoeener: 1743.77503211 hartree
cpcmener: -0.02784559 hartree
kineticenergy: 1597.01826576 hartree
xcener: -99.374674894023 hartree
chargesum: 0.0000000
charge: -0.175247 -0.161511 0.859285 -0.366385 -0.351201 -0.646948 -0.101941 -0.162345 -0.108070 -0.255289 -0.117493 -0.104451 0.139660 0.131375 0.126364 0.116016 0.099475 0.091462 0.087154 0.094965 0.086760 0.116867 0.128210 0.123428 0.122493 0.134230 0.093138
qa: -0.1752 -0.1615 0.8593 -0.3664 -0.3512 -0.6469 -0.1019 -0.1623 -0.1081 -0.2553 -0.1175 -0.1045 0.1397 0.1314 0.1264 0.1160 0.0995 0.0915 0.0872 0.0950 0.0868 0.1169 0.1282 0.1234 0.1225 0.1342 0.0931
va: 2.2792 2.1926 5.4651 2.1072 2.0674 1.9377 3.8294 3.9940 3.9890 3.9227 3.8505 3.8304 0.9950 1.0270 1.0111 1.0127 0.9998 0.9988 1.0091 1.0022 1.0063 0.9935 0.9885 0.9918 0.9940 0.9927 1.0142
dispcorr: -0.010776832 hartree
energy: -1601.290488338090
dipole: -11.63865 11.06069 -0.57796 -1.61349 1.97005 0.35655 -4.80823 4.67381 -0.13442
magnitude: 0.69227 au
magnitude: 1.75961 debye
