program: Orca
programVersion: 5.0.4
elementType: S S P O O O C C C C C C H H H H H H H H H H H H H H H
charge: 0
multiplicity: 1
keywords: wb97x-d3
keywords: def2-TZVPP
keywords: def2/J RIJCOSX
keywords: DEFGRID2
keywords: scfconv7
keywords: smallprint printgap noloewdin
keywords: NOSOSCF
formula: C6H15O3PS2
InChI: InChI=1/C6H15O3PS2/c1-4-11-5-6-12-10(7,8-2)9-3/h4-6H2,1-3H3
27 atoms
S  0.63839 1.406072 0.059811
S  -2.317623 -0.128117 1.007273
P  1.429724 -0.493081 -0.249007
O  2.036693 -0.871184 1.176919
O  2.758462 -0.324588 -1.111568
O  0.521397 -1.477488 -0.879052
C  -0.916925 1.389948 -0.900272
C  -2.138139 1.360199 -0.00183
C  -2.8914 -1.324749 -0.233608
C  -4.341501 -1.14167 -0.632301
C  1.183056 -1.176658 2.2857
C  3.802186 0.592695 -0.769977
H  -0.90642 0.564366 -1.608889
H  -0.916201 2.312866 -1.481046
H  -3.027825 1.495686 -0.620801
H  -2.116379 2.200834 0.693048
H  -2.236822 -1.283412 -1.1042
H  -2.739416 -2.303929 0.222656
H  -5.005069 -1.242432 0.225499
H  -4.517338 -0.165121 -1.082992
H  -4.626732 -1.894689 -1.368168
H  0.500194 -1.990126 2.044321
H  0.608724 -0.302349 2.588643
H  1.83144 -1.483558 3.101782
H  4.514758 0.576776 -1.590386
H  4.307328 0.293463 0.147411
H  3.419404 1.608607 -0.660704
elementType: S P O C H
totalener: -1601.27947503 hartree
nucrepener: 1175.69501332 hartree
electener: -2776.97448835 hartree
oneelecener: -4545.22809420 hartree
twoeener: 1768.25360585 hartree
cpcmener: -0.02899037 hartree
kineticenergy: 1597.02591875 hartree
xcener: -99.378873471557 hartree
chargesum: 0.0000000
charge: -0.205742 -0.171868 0.854925 -0.346575 -0.357577 -0.636802 -0.080700 -0.136644 -0.094146 -0.257798 -0.108651 -0.109404 0.113037 0.133874 0.116383 0.114886 0.087784 0.108422 0.079488 0.085176 0.092651 0.116126 0.107705 0.134012 0.127761 0.124458 0.109217
qa: -0.2057 -0.1719 0.8549 -0.3466 -0.3576 -0.6368 -0.0807 -0.1366 -0.0941 -0.2578 -0.1087 -0.1094 0.1130 0.1339 0.1164 0.1149 0.0878 0.1084 0.0795 0.0852 0.0927 0.1161 0.1077 0.1340 0.1278 0.1245 0.1092
va: 2.2564 2.1687 5.4884 2.0761 2.1041 1.9606 3.8344 3.9950 3.9267 3.9451 3.8459 3.8423 1.0265 1.0085 1.0074 1.0090 1.0192 1.0025 1.0112 1.0024 1.0047 0.9936 0.9984 0.9924 0.9892 0.9913 0.9968
dispcorr: -0.011404002 hartree
energy: -1601.290879035228
dipole: -11.43287 11.38974 -0.04312 0.12587 1.48455 1.61042 -0.85270 1.12763 0.27493
magnitude: 1.63429 au
magnitude: 4.15403 debye
