program: Orca
programVersion: 5.0.4
elementType: S S P O O O C C C C C C H H H H H H H H H H H H H H H
charge: 0
multiplicity: 1
keywords: wb97x-d3
keywords: def2-TZVPP
keywords: def2/J RIJCOSX
keywords: DEFGRID2
keywords: scfconv7
keywords: smallprint printgap noloewdin
keywords: NOSOSCF
formula: C6H15O3PS2
InChI: InChI=1/C6H15O3PS2/c1-4-11-5-6-12-10(7,8-2)9-3/h4-6H2,1-3H3
27 atoms
S  -0.039428 -1.400659 0.10419
S  -2.15867 0.88047 -1.344335
P  1.839991 -0.567215 0.240589
O  2.011087 -0.240071 1.787986
O  1.812406 0.903877 -0.38772
O  2.829736 -1.486787 -0.369564
C  -1.117037 -0.247595 1.025884
C  -1.474486 1.044938 0.320792
C  -3.588504 -0.202119 -1.061007
C  -4.624668 0.36839 -0.11443
C  3.233012 0.336893 2.280342
C  1.670007 1.074616 -1.802126
H  -0.664347 -0.02947 1.992807
H  -2.008963 -0.840295 1.230761
H  -0.599933 1.68681 0.215011
H  -2.174422 1.584429 0.962008
H  -4.018249 -0.351778 -2.052593
H  -3.246813 -1.182233 -0.724826
H  -4.995896 1.330348 -0.465638
H  -5.473082 -0.313284 -0.037512
H  -4.227188 0.505342 0.891636
H  3.204311 0.249072 3.362547
H  3.303433 1.388504 2.005907
H  4.103861 -0.198945 1.903859
H  2.458112 0.55446 -2.345913
H  1.744769 2.139687 -2.001668
H  0.697881 0.716505 -2.142885
elementType: S P O C H
totalener: -1601.28094640 hartree
nucrepener: 1166.11927782 hartree
electener: -2767.40022422 hartree
oneelecener: -4525.29089864 hartree
twoeener: 1757.89067442 hartree
cpcmener: -0.03281918 hartree
kineticenergy: 1597.02295588 hartree
xcener: -99.378749466437 hartree
chargesum: 0.0000000
charge: -0.170753 -0.167026 0.836096 -0.350879 -0.346132 -0.656122 -0.125239 -0.171744 -0.096532 -0.259286 -0.111191 -0.110299 0.142059 0.134126 0.130791 0.127529 0.114954 0.088364 0.081277 0.097243 0.085700 0.127722 0.124774 0.117447 0.129394 0.133528 0.094199
qa: -0.1708 -0.1670 0.8361 -0.3509 -0.3461 -0.6561 -0.1252 -0.1717 -0.0965 -0.2593 -0.1112 -0.1103 0.1421 0.1341 0.1308 0.1275 0.1150 0.0884 0.0813 0.0972 0.0857 0.1277 0.1248 0.1174 0.1294 0.1335 0.0942
va: 2.2906 2.1926 5.4990 2.0801 2.0445 1.9549 3.8740 3.9825 3.9454 3.9255 3.8371 3.8073 1.0163 0.9938 1.0073 1.0040 1.0001 1.0082 1.0131 1.0042 0.9995 0.9888 0.9914 0.9954 1.0017 0.9881 1.0194
dispcorr: -0.011711627 hartree
energy: -1601.292658023792
dipole: -13.21986 11.65940 -1.56046 7.96384 -6.26859 1.69524 2.75430 -1.43025 1.32405
magnitude: 2.65744 au
magnitude: 6.75467 debye
