program: Orca
programVersion: 5.0.4
elementType: S S P O O O C C C C C C H H H H H H H H H H H H H H H
charge: 0
multiplicity: 1
keywords: wb97x-d3
keywords: def2-TZVPP
keywords: def2/J RIJCOSX
keywords: DEFGRID2
keywords: scfconv7
keywords: smallprint printgap noloewdin
keywords: NOSOSCF
formula: C6H15O3PS2
InChI: InChI=1/C6H15O3PS2/c1-4-11-5-6-12-10(7,8-2)9-3/h4-6H2,1-3H3
27 atoms
S  0.9345 1.515364 0.072946
S  -3.424313 0.70393 0.15646
P  1.437928 -0.48475 -0.24368
O  2.036528 -0.999235 1.144351
O  2.728593 -0.500069 -1.168524
O  0.335766 -1.286571 -0.822469
C  -0.836765 1.484064 -0.404334
C  -1.714586 0.946268 0.709005
C  -3.269657 -0.888378 -0.711884
C  -3.096551 -2.07821 0.21259
C  1.19611 -1.107429 2.29894
C  3.922206 0.227622 -0.854238
H  -0.937762 0.922432 -1.32993
H  -1.081889 2.523068 -0.622691
H  -1.744298 1.650555 1.540718
H  -1.337585 0.004433 1.10692
H  -4.187074 -0.987983 -1.293647
H  -2.451828 -0.827166 -1.431649
H  -3.025079 -2.997881 -0.371078
H  -2.188963 -2.0056 0.812846
H  -3.942918 -2.175833 0.892034
H  0.790454 -0.134915 2.58186
H  1.81885 -1.480203 3.107691
H  0.377828 -1.806653 2.126509
H  4.385659 -0.146263 0.057607
H  3.720686 1.295287 -0.751855
H  4.604929 0.082197 -1.686737
elementType: S P O C H
totalener: -1601.28158639 hartree
nucrepener: 1161.48704416 hartree
electener: -2762.76863055 hartree
oneelecener: -4516.11134371 hartree
twoeener: 1753.34271316 hartree
cpcmener: -0.02847211 hartree
kineticenergy: 1597.00704739 hartree
xcener: -99.372610473179 hartree
chargesum: -0.0000000
charge: -0.215773 -0.185058 0.846310 -0.340672 -0.355826 -0.637422 -0.073772 -0.131623 -0.104690 -0.252465 -0.115978 -0.111024 0.116468 0.136547 0.134580 0.088339 0.114165 0.091351 0.097407 0.074431 0.084058 0.111754 0.136808 0.124263 0.126930 0.111332 0.129559
qa: -0.2158 -0.1851 0.8463 -0.3407 -0.3558 -0.6374 -0.0738 -0.1316 -0.1047 -0.2525 -0.1160 -0.1110 0.1165 0.1365 0.1346 0.0883 0.1142 0.0914 0.0974 0.0744 0.0841 0.1118 0.1368 0.1243 0.1269 0.1113 0.1296
va: 2.2544 2.1688 5.4803 2.0711 2.1174 1.9536 3.8209 3.9706 3.9260 3.9211 3.8422 3.8436 1.0275 1.0098 1.0093 1.0212 1.0017 1.0185 1.0038 1.0033 1.0143 0.9944 0.9918 0.9853 0.9912 0.9912 0.9889
dispcorr: -0.011967986 hartree
energy: -1601.293554375132
dipole: -5.75474 6.93406 1.17932 -4.71880 5.45315 0.73435 4.29815 -3.08134 1.21681
magnitude: 1.84680 au
magnitude: 4.69420 debye
