program: Orca
programVersion: 5.0.4
elementType: S S P O O O C C C C C C H H H H H H H H H H H H H H H
charge: 0
multiplicity: 1
keywords: wb97x-d3
keywords: def2-TZVPP
keywords: def2/J RIJCOSX
keywords: DEFGRID2
keywords: scfconv7
keywords: smallprint printgap noloewdin
keywords: NOSOSCF
formula: C6H15O3PS2
InChI: InChI=1/C6H15O3PS2/c1-4-11-5-6-12-10(7,8-2)9-3/h4-6H2,1-3H3
27 atoms
S  0.548455 1.384994 -0.404667
S  -3.151238 -1.040772 0.047518
P  1.874639 -0.148897 0.000246
O  1.782203 -0.322996 1.5818
O  3.301687 0.548932 -0.155213
O  1.657756 -1.379216 -0.800137
C  -0.966686 0.426631 -0.790971
C  -1.56864 -0.245411 0.427393
C  -4.249318 0.407705 -0.002361
C  -5.670685 -0.040696 -0.283798
C  2.495115 -1.391642 2.229077
C  3.888277 0.728706 -1.450805
H  -0.743378 -0.289716 -1.579002
H  -1.6421 1.175693 -1.204753
H  -1.707597 0.466434 1.242489
H  -0.917242 -1.038862 0.795465
H  -4.191652 0.92439 0.956964
H  -3.913166 1.099731 -0.775297
H  -6.037427 -0.720494 0.4855
H  -6.334114 0.823997 -0.306337
H  -5.749498 -0.543731 -1.247695
H  3.571986 -1.236091 2.169125
H  2.241205 -2.357961 1.794901
H  2.190733 -1.380138 3.271861
H  3.332243 1.464534 -2.032461
H  3.932544 -0.210171 -2.001455
H  4.89887 1.093658 -1.289507
elementType: S P O C H
totalener: -1601.28206626 hartree
nucrepener: 1119.24941175 hartree
electener: -2720.53147801 hartree
oneelecener: -4431.88852110 hartree
twoeener: 1711.35704310 hartree
cpcmener: -0.02857973 hartree
kineticenergy: 1597.01349468 hartree
xcener: -99.370105029634 hartree
chargesum: -0.0000000
charge: -0.179652 -0.173247 0.861768 -0.357231 -0.366029 -0.648170 -0.095758 -0.121326 -0.118335 -0.252180 -0.114048 -0.104783 0.114746 0.135738 0.107575 0.116789 0.097241 0.096641 0.087599 0.094916 0.087399 0.125897 0.116960 0.129385 0.110784 0.117599 0.129722
qa: -0.1797 -0.1732 0.8618 -0.3572 -0.3660 -0.6482 -0.0958 -0.1213 -0.1183 -0.2522 -0.1140 -0.1048 0.1147 0.1357 0.1076 0.1168 0.0972 0.0966 0.0876 0.0949 0.0874 0.1259 0.1170 0.1294 0.1108 0.1176 0.1297
va: 2.2933 2.1946 5.4734 2.0634 2.0891 1.9368 3.8486 3.9567 4.0070 3.9145 3.8369 3.8446 1.0383 1.0025 1.0184 1.0198 1.0002 0.9979 1.0077 1.0027 1.0071 0.9911 0.9965 0.9884 0.9936 0.9966 0.9898
dispcorr: -0.009800708 hartree
energy: -1601.291866966397
dipole: -11.79230 12.00209 0.20979 0.23076 1.04586 1.27662 0.25868 0.11442 0.37311
magnitude: 1.34646 au
magnitude: 3.42244 debye
