program: Orca
programVersion: 5.0.4
elementType: S S P O O O C C C C C C H H H H H H H H H H H H H H H
charge: 0
multiplicity: 1
keywords: wb97x-d3
keywords: def2-TZVPP
keywords: def2/J RIJCOSX
keywords: DEFGRID2
keywords: scfconv7
keywords: smallprint printgap noloewdin
keywords: NOSOSCF
formula: C6H15O3PS2
InChI: InChI=1/C6H15O3PS2/c1-4-11-5-6-12-10(7,8-2)9-3/h4-6H2,1-3H3
27 atoms
S  0.892146 1.423051 0.007666
S  -3.489871 0.773158 0.234411
P  1.579255 -0.531854 -0.210831
O  2.356871 -0.835895 1.149939
O  2.773964 -0.493256 -1.256567
O  0.539803 -1.504297 -0.619434
C  -0.866427 1.261898 -0.486102
C  -1.731159 0.804353 0.66976
C  -3.574902 -0.629065 -0.920257
C  -3.215148 -1.966527 -0.306145
C  1.64609 -0.893116 2.393577
C  3.914602 0.359177 -1.103584
H  -0.935087 0.603826 -1.34878
H  -1.150667 2.262511 -0.809526
H  -1.650305 1.505357 1.501462
H  -1.418059 -0.17143 1.041758
H  -4.611687 -0.633233 -1.26036
H  -2.960955 -0.421736 -1.797479
H  -3.830568 -2.181178 0.567021
H  -3.372521 -2.763119 -1.035101
H  -2.16902 -2.007937 -0.005034
H  0.873584 -1.661367 2.371064
H  1.192889 0.07063 2.630282
H  2.374381 -1.141051 3.160889
H  4.52152 0.057083 -0.251346
H  3.618854 1.403409 -0.988519
H  4.501345 0.262168 -2.012718
elementType: S P O C H
totalener: -1601.28172585 hartree
nucrepener: 1148.68870066 hartree
electener: -2749.97042651 hartree
oneelecener: -4490.49481699 hartree
twoeener: 1740.52439048 hartree
cpcmener: -0.02822828 hartree
kineticenergy: 1597.01361976 hartree
xcener: -99.373785827450 hartree
chargesum: -0.0000000
charge: -0.214322 -0.181961 0.847621 -0.342703 -0.354190 -0.636676 -0.061836 -0.148937 -0.108567 -0.249268 -0.116884 -0.109717 0.118427 0.127093 0.128454 0.104218 0.110937 0.096003 0.080906 0.097698 0.075417 0.126259 0.111879 0.135311 0.125386 0.110694 0.128760
qa: -0.2143 -0.1820 0.8476 -0.3427 -0.3542 -0.6367 -0.0618 -0.1489 -0.1086 -0.2493 -0.1169 -0.1097 0.1184 0.1271 0.1285 0.1042 0.1109 0.0960 0.0809 0.0977 0.0754 0.1263 0.1119 0.1353 0.1254 0.1107 0.1288
va: 2.2574 2.1808 5.4797 2.0735 2.1152 1.9565 3.8154 3.9846 3.9517 3.9021 3.8379 3.8462 1.0285 1.0192 1.0089 1.0165 0.9992 1.0072 1.0157 1.0043 1.0136 0.9880 0.9958 0.9914 0.9913 0.9925 0.9892
dispcorr: -0.011304890 hartree
energy: -1601.293030740106
dipole: -6.26320 7.32137 1.05817 -3.63283 4.60498 0.97215 2.14756 -1.34420 0.80336
magnitude: 1.64626 au
magnitude: 4.18447 debye
